AAA-Anwendungsschema
type: Ontology
type: Entity
comment: RDFS/SKOS ontology derived from AAA-Fachschema.xsd (NAS) by adv-fachschema.xsl @en
version info: 7.1.2
generated at time: 2026-03-31T09:34:12.615Z
had primary source: adv-fachschema.rdf
had primary source: adv-objektkatalog.rdf

AA Aktivitaet
type: Class
kennung: 09300
comment: Die Aktivität ist Teil eines Vorgangs. Ein in Projektsteuerungskatalog vorzugebender Workflow legt die Reihenfolge und Abhängigkeiten der Aktivitäten und deren Arbeitsschritte fest. Die Aktivitäten werden in einer bestimmten Reihenfolge nacheinander bzw. nebeneinander bearbeitet. Die Entscheidung über den Abschluss der einzelnen Aktivitäten wird im Status (Meilenstein) dokumentiert.
subclass of: AA NREO
subclass of: Restriction
  max cardinality: 1
  on property: erlaeuterung
subclass of: Restriction
  max cardinality: 1
  on property: inversZu enthaelt
subclass of: Restriction
  cardinality: 1
  on property: art
subclass of: Restriction
  cardinality: 1
  on property: status

AA Antrag
type: Class
kennung: 09000
comment: Diese Objektart realisiert eine "Mini-Antragsverwaltung", d.h. eine Schnittstelle zur externen Antragsverwaltung. Dadurch wird es möglich, bei einem Eintrag in der externen Antragsverwaltung (Geschäftsbuch) direkt einen Bezug zu diesem Antrag in ALKIS (mit Raumbezug) zu generieren. Das Antragsobjekt verwaltet außerdem die Wiedervorlage des Antrags und unterstützt die Überwachung der Projektsteuerungs-Objekte. Mit dem Raumbezug kann nach bestehenden ALKIS- Prozessen gesucht werden, um konkurrierende Anträge zu ermitteln oder um andere benachbarte Anträge bei der Bearbeitung zu berücksichtigen. Die fachliche Reihenfolge konkurrierender Anträge ist durch den Sachbearbeiter festzulegen. Hinweis: Die Beziehung von einem Fachobjekt zu AA_Antrag kann über eine Fachdatenverbindung der Art "urn:adv:fachdatenverbindung:AA_Antrag" realisiert werden. Das Antragsobjekt wird über die URN des Antragsobjekts identifiziert.
subclass of: AA NREO
subclass of: Restriction
  max cardinality: 1
  on property: bearbeitungsstatus
subclass of: Restriction
  max cardinality: 1
  on property: gebiet
subclass of: Restriction
  cardinality: 1
  on property: kennzeichen
subclass of: Restriction
  cardinality: 1
  on property: antragUnterbrochen
subclass of: Restriction
  max cardinality: 1
  on property: erlaeuterungZumStatus
subclass of: Restriction
  min cardinality: 1
  on property: verweistAuf
subclass of: Restriction
  cardinality: 1
  on property: art

AA Antragsgebiet
type: Class
kennung: 09500
subclass of: AU Flaechenobjekt

AA Auftrag
type: Class
kennung: 08100
comment: Der 'Auftrag' ist die abstrakte Oberklasse aller Aufträge.
subclass of: AbstractObject

AA Benutzer
type: Class
kennung: 07100
comment: In den aus der abstrakten Objektart 'Benutzer' abgeleiteten Objektarten werden Benutzer verwaltet. Diese Objektart bündelt die fachsystemspezifischen Ausprägungen von Benutzern.
subclass of: AA NREO

AA Benutzergruppe
type: Class
kennung: 07000
comment: In den aus der abstrakten Objektart 'Benutzergruppe' abgeleiteten Objektarten werden Benutzergruppen verwaltet. Diese Objektart bündelt die fachsystemspezifischen Ausprägungen von Benutzergruppen.
subclass of: AA NREO

AA Benutzungsauftrag
type: Class
kennung: 08110
comment: Durch einen AA_Benutzungsauftrag werden allgemeine Informationen für eine Ausgabe bereitgestellt. Der AA_Benutzungsauftrag unterstützt standardmäßig die Ausgabe von Bestandsdatenauszügen. Fachinformationssystemspezifische Ausgaben und Auftragsinformationen können in abgeleiteten Auftragstypen definiert werden.
subclass of: AA Auftrag
subclass of: Restriction
  cardinality: 1
  on property: art
subclass of: Restriction
  max cardinality: 1
  on property: koordinatenreferenzsystem
subclass of: Restriction
  min cardinality: 1
  on property: anforderungsmerkmale

AA Bestandsdatenauszug
type: Class
kennung: 08210
comment: Die Ausgabeobjektart 'Bestandsdatenauszug' enthält Informationen für die Ausgabe des Bestandsdatenauszuges. Der 'Bestandsdatenauszug' enthält alle Objekte, die aufgrund der Auswertung des Attributes 'Anforderungsmerkmale' des 'Benutzungsauftrag's aus den Bestandsdaten selektiert werden.
subclass of: AA Ergebnis
subclass of: Restriction
  max cardinality: 1
  on property: enthaelt

Empfänger
type: Class
kennung: 81006
comment: 'Empfänger' beschreibt, wie das Ergebnis zurückgeliefert werden soll. Vorgesehen sind vier Möglichkeiten: 1. Bei 'direkt' erfolgt eine Rückmeldung des Ergebnisses im Rahmen der bestehenden Netzwerkverbindung über die der Auftrag übermittelt wurde. 2. Bei 'email' wird das Ergebnis per Email an den genannten Empfänger übermittelt. 3. Bei 'http' wird das Ergebnis durch Aufruf des beschriebenen Webservices an den genannten Empfänger übermittelt. Das Ergebnis wird im Payload des HTTP PUT Requests übertragen (MIME-Format text/xml). 4. Bei 'manuell' muss der angegebene Empfänger manuell von einem Bearbeiter gesichtet werden. Dieser leitet dann das Ergebnis an den Empfänger weiter.
subclass of: AbstractObject

AA Ergebnis
type: Class
kennung: 08200
comment: Das 'Ergebnis' ist die abstrakte Oberklasse aller erfolgreichen Ergebnisse. Sofern ein Fehler auftritt, wird stattdessen ein 'ExceptionReport' erzeugt.
subclass of: AbstractObject

AA Fachdatenobjekt
type: Class
kennung: 00210
comment: Der Verweis auf das Fachdatenobjekt kann entweder aus einer Namens- bzw. ID-Angabe oder aus einem URI bestehen.
subclass of: AbstractObject

AA Fachdatenverbindung
type: Class
kennung: 00200
comment: Sollen Objekte einer Objektart auf Fachdaten zeigen, die in einem externen Fachinformationssystem geführt werden, so kann das optional durch das Attribut 'zeigtAufExternes' beschrieben werden.
subclass of: AbstractObject

AA Fortfuehrungsauftrag
type: Class
kennung: 08150
comment: Die Objektart AA_Fortfuehrungsauftrag aktualisiert Bestandsdaten. Fachinformationssystemspezifische Fortführungsaufträge können zusätzliche Vorgaben realisieren. Sinngemäßer Ablauf der Verarbeitung: 1. Eröffnen der Protokolldatei 2. Einlesen der zu verarbeitenden Objektänderungen (Transaction) = qualifizierte Erhebungsdaten 3. Prüfung der selbstbezogenen Eigenschaften der einzutragenden und zu überschreibenden Objekte gegen die Festlegungen des Objektartenkatalogs (Vollständigkeitsprüfung, Prüfung zulässiger Werte, Prüfung definierter Werteabhängigkeiten) 4. Prüfung der Aktualität der zu überschreibenden und zu löschenden Objekte, dabei Prüfung ob diese Objekte bereits durch einen anderen Auftrag gesperrt sind und Sperren dieser Objekte im Bestand (soweit noch nicht explizit für diesen Auftrag gesperrt). 5. Soweit Sperrungen durch andere Aufträge vorliegen: Status "Abbruch der Verarbeitung" setzen und Auflistung der gesperrten Objekte im Verarbeitungsprotokoll. 6. Prüfung der fremdbezogenen Eigenschaften der einzutragenden, zu überschreibenden und zu löschenden Objekte innerhalb der qualifizierten Erhebungsdaten und gegen den Bestand. Prüfung, ob referenzierte Objekte bereits durch andere Aufträge gesperrt sind 7. Soweit Sperrungen durch andere Aufträge vorliegen: Status "Abbruch der Verarbeitung" setzen und Auflistung der gesperrten Objekte im Verarbeitungsprotokoll. 8. Soweit Status "Abbruch der Verarbeitung" vorliegt: Abbruch der Verarbeitung. Rücknahme der durchgeführten eigenen Sperrungen. Zurücksetzen des Auftrags. Ausgabe des Verarbeitungsprotokolls. 9. Fortführungsfallbezogene Erzeugung der impliziten Fortführungsdaten: Es handelt sich um Maßnahmen zur Erhaltung der Konsistenz der Daten. Diese Konsistenz muss am Ende des Fortführungsfalles und des Fortführungsauftrages vorliegen, zwischenzeitliche Inkonsistenzen werden hingenommen. Für die in 9.1 implizit erzeugten Löschbefehle kann das bedeuten, dass sie wieder aufgehoben werden müssen. 9.1. Feststellen, ob…
subclass of: AA Auftrag
subclass of: Restriction
  cardinality: 1
  on property: geaenderteObjekte

AA Fortfuehrungsergebnis
type: Class
kennung: 08350
comment: Das Ergebnis eines Fortführungsauftrags umfasst Informationen zum Ergebnis der Ausführung. Bei Fehlersituationen ist eine ExceptionFortfuehrung zu erzeugen.
subclass of: AA Ergebnis

AA Gebuehrenangaben
type: Class
kennung: 09111
subclass of: AbstractObject

AA Gebuehrenparameter
type: Class
kennung: 09112
comment: Dieser Datentyp repräsentiert gebührenrelevante Informationen innerhalb eines Projektsteuerungs-Objektes. Die Einzelheiten sind in den Fachschemata zu regeln.
subclass of: AbstractObject

AA Koordinatenreferenzsystemangaben
type: Class
kennung: 08230
subclass of: AbstractObject

AA Lebenszeitintervall
type: Class
kennung: 00300
comment: Das Lebenszeitintervall wird (gemäß der Definitionen der Lebenszeitintervallbeschreibung für jede Objektart des OK) als Anfang und Ende der Lebenszeit festgelegt. Ziel ist es, bei Bedarf aus fachlicher Sicht Angaben über die Lebenszeit von Objekten abzulegen und ein Mittel zur Unterscheidung von Objektversionen zur Verfügung zu stellen. Die Angaben zum Lebenszeitintervall stehen in engem Zusammenhang mit den Bildungsregeln einer Objektart und den Regeln zur Objektversionierung.
subclass of: AbstractObject

AA Meilenstein
type: Class
kennung: 09220
comment: Datentyp, der zu einem Vorgang usw. den aktuellen Zustand und die Verantwortlichkeiten vermerkt.
subclass of: AA NREO
subclass of: Restriction
  max cardinality: 1
  on property: begonnen
subclass of: Restriction
  max cardinality: 1
  on property: abgeschlossen
subclass of: Restriction
  max cardinality: 1
  on property: erfolgreich
subclass of: Restriction
  max cardinality: 1
  on property: wannAbgeschlossen
subclass of: Restriction
  max cardinality: 1
  on property: kategorie
subclass of: Restriction
  max cardinality: 1
  on property: bemerkung
subclass of: Restriction
  max cardinality: 1
  on property: wer

AA Modellart
type: Class
kennung: 00400
comment: Die 'Union' AA_Modellart klammert die möglichen Arten von Modellartenkennungen und unterscheidet nach Standardprodukten der AdV und sonstigen Produkten. Unter die sonstigen Produkte fallen auch die länderspezifisch nur in einigen Bundesländern geführten Produkte.
subclass of: AbstractObject

AA NREO
type: Class
kennung: 01000
comment: Ein nicht raumbezogenes Elementarobjekt (AA_NREO) hat alle Eigenschaften eines Objektes, aber es besitzt im Unterschied zu den raumbezogenen Elementarobjekten keine geometrische oder topologische Beschreibung.
subclass of: AA Objekt

AA Objekt
type: Class
kennung: 00001
comment: Klasse, die für Fachobjekte grundlegende Eigenschaften realisiert. AA_Objekt fasst Verwaltungseigenschaften, die allen Objekten gemeinsam sind, zusammen. Soll ein Objekt auf ein Fachdatenobjekt zeigen, das in einem fremden Fachdatensystem unter 'AA_Fachdatenobjekt' geführt wird, so kann das optional durch das Attribut 'zeigtAufExternes' beschrieben werden. Das Attribut 'zeigtAufExternes' ist im Objektartenkatalog zu erläutern. Fachobjekte können Teil von zusammengesetzten Objekten sein.
subclass of: AbstractFeature
subclass of: Restriction
  cardinality: 1
  on property: lebenszeitintervall
subclass of: Restriction
  min cardinality: 1
  on property: modellart
subclass of: Restriction
  max cardinality: 2
  on property: anlass
subclass of: Restriction
  max cardinality: 1
  on property: quellobjektID

AA Projektsteuerung
type: Class
kennung: 09100
comment: Das Antrags-Objekt wird mit dem Projektsteuerungs-Objekt (AA_Projektsteuerung) verbunden, um die Zuordnung des Antrags zu einem oder mehreren Projektsteuerungs-Objekten festzulegen und um die nicht zulässigen Kombinationen zu überwachen. Weiterhin steuert und überwacht das Projektsteuerungs-Objekt die korrekte Abwicklung der Vorgänge im Teilprozess "fachtechnische Qualifizierung". Die Fortführungsanlässe werden beim Projektsteuerungs-Objekt geführt. Der AA_Projektsteuerung regelt und überwacht die Zeichnungsbefugnis. Zu klären sind zukünftig Aspekte zur Rechtssicherheit, Authentifizierung, usw.
subclass of: AA NREO
subclass of: Restriction
  min cardinality: 1
  on property: anlassDesProzesses
subclass of: Restriction
  max cardinality: 1
  on property: inversZu verweistAuf
subclass of: Restriction
  min cardinality: 1
  on property: enthaelt
subclass of: Restriction
  cardinality: 1
  on property: art

AA REO
type: Class
kennung: 02000
comment: Ein raumbezogenes Elementarobjekt (AA_REO) ist ein Objekt, das seinen Raumbezug, seine geometrische und topologische Beschreibung durch eine oder mehrere Raumbezugsgrundformen erhält. Raumbezogene Elementarobjekte können auch Präsentationsobjekte oder Kartengeometrieobjekte sein. Präsentationsobjekte sind Texte und Kartensignaturen, die nicht vollautomatisch aus den entsprechenden Fachobjekten für einen bestimmten Zielmaßstab erzeugt und platziert werden können. Die Präsentationsobjekte sind wie andere Objekte im Objektartenkatalog in Verbindung mit dem jeweiligen Signaturenkatalog zu definieren. Kartengeometrieobjekte sind Objekte, die bei der Ableitung für einen bestimmten Kartenmaßstab aus Gründen der kartographischen Modellgeneralisierung ihre geometrische Form und/oder Lage verändern müssen. Sie verweisen über eine einseitige Relation 'istAbgeleitetAus' auf das zugehörige raumbezogene Elementarobjekt. Diese Objekte tragen die Modellart der jeweiligen DTK (Digitale Topographische Karte) und übernehmen alle Attribute des zugehörigen raumbezogenen Elementarobjekts des DLM (Digitales Landschaftsmodell). Mit der Einführung der Modellart lassen sich Präsentations- und Kartengeometrieobjekte von den "normalen" topographischen DLM-Objekten bzw. den liegenschaftsbezogenen Objekten der ALKIS-Bestandsdaten unterscheiden und entsprechend auswerten. Für raumbezogene Elementarobjekte stellt das Modell weitere Subklassen mit konkretisierten raumbezogenen Eigenschaften zur Verfügung; erst aus diesen sollten die konkreten fachlichen Objekte mit Raumbezug abgeleitet werden.
subclass of: AA Objekt

AA Themendefinition
type: Class
kennung: 08400
comment: Die in einer Anwendung vorkommenden Themen sind in einer XML-Datei explizit zu deklarieren. AX_Themendefinition dient dazu als Muster Die Deklarationen müssen mit den Angaben im Objektartenkatalog übereinstimmen.
subclass of: AbstractObject

AA Vorgang
type: Class
kennung: 09200
comment: Der Vorgang ist Teil einer Projektsteuerung und setzt sich aus einzelnen Aktivitäten zusammen. Die Vorgänge stellen in sich abgeschlossene Arbeitsschritte dar. Ein vorzugebender Workflow legt die Reihenfolge und Abhängigkeiten der Vorgänge und deren Arbeitsschritte fest. Die Vorgänge werden in Gruppen zusammengefasst und in einer bestimmten Reihenfolge nacheinander bzw. nebeneinander bearbeitet. Die Entscheidung über den Abschluss des einzelnen Vorganges wird im Status (Meilenstein) dokumentiert.
subclass of: AA NREO
subclass of: Restriction
  max cardinality: 1
  on property: erlaeuterung
subclass of: Restriction
  cardinality: 1
  on property: art
subclass of: Restriction
  cardinality: 1
  on property: bearbeitbarDurch
subclass of: Restriction
  max cardinality: 1
  on property: inversZu enthaelt
subclass of: Restriction
  max cardinality: 1
  on property: synchronisiertMit
subclass of: Restriction
  cardinality: 1
  on property: status
subclass of: Restriction
  max cardinality: 1
  on property: inversZu synchronisiertMit

AA ZUSO
type: Class
kennung: 03000
comment: Neben den Elementarobjekten kennt das gemeinsame Datenmodell auch ein zusammengesetztes Objekt (AA_ZUSO). Es kann aus einer beliebigen Zahl und Mischung semantisch zusammengehörender raumbezogener Elementarobjekte, nicht raumbezogener Elementarobjekte oder zusammengesetzter Objekte bestehen. Ein zusammengesetztes Objekt muss aber mindestens aus einem Objekt bestehen.
subclass of: AA Objekt

AD GitterCoverage
type: Class
kennung: 04200
comment: Die abstrakte Klasse AD_GitterCoverage dient zur Ableitung von Fachobjekten, die aus einer großen Anzahl von gitterförmig angeordneten Punkten bestehen, für die jeweils 1..n Attributwerte zu den für alle Punkte identischen Attributarten gespeichert werden sollen. Sie implementiert CV_DiscretGridPointCoverage aus ISO 19123.
subclass of: RectifiedGridCoverage
subclass of: Restriction
  cardinality: 1
  on property: lebenszeitintervall
subclass of: Restriction
  min cardinality: 1
  on property: modellart
subclass of: Restriction
  max cardinality: 2
  on property: anlass
subclass of: Restriction
  max cardinality: 1
  on property: quellobjektID
subclass of: Restriction
  max cardinality: 1
  on property: beschreibung

AD PunktCoverage
type: Class
kennung: 04100
comment: Die abstrakte Klasse AD_PunktCoverage dient zur Ableitung von Fachobjekten, die aus einer großen Anzahl beliebig verteilter Punkte bestehen, für die jeweils 1..n Attributwerte zu den für alle Punkte identischen Attributarten gespeichert werden sollen. Sie implementiert CV_DiscretPointCoverage aus ISO 19123.
subclass of: MultiPointCoverage
subclass of: Restriction
  cardinality: 1
  on property: lebenszeitintervall
subclass of: Restriction
  min cardinality: 1
  on property: modellart
subclass of: Restriction
  max cardinality: 2
  on property: anlass
subclass of: Restriction
  max cardinality: 1
  on property: quellobjektID
subclass of: Restriction
  max cardinality: 1
  on property: beschreibung

AG Flaechenobjekt
type: Class
kennung: 02213
comment: Dies ist die Basisklasse für raumbezogene Fachobjekte, die geometrisch durch eine Fläche repräsentiert werden und sich mit anderen raumbezogenen Fachobjekten des gleichen AA_PunktLinienThemas Linien- und Punktgeometrie teilen.
subclass of: AG ObjektMitGemeinsamerGeometrie
subclass of: Restriction
  cardinality: 1
  on property: position

AG Linienobjekt
type: Class
kennung: 02212
comment: Dies ist die Basisklasse für raumbezogene Fachobjekte, die geometrisch durch eine zusammengesetzte Linie repräsentiert werden und sich mit anderen raumbezogenen Fachobjekten des gleichen AA_PunktLinienThemas Linien- und Punktgeometrie teilen.
subclass of: AG ObjektMitGemeinsamerGeometrie
subclass of: Restriction
  cardinality: 1
  on property: position

AG Objekt
type: Class
kennung: 02210
comment: Der Auswahldatentyp 'AG_Objekt' erlaubt es, Subklassen zu bilden, bei denen die konkrete Art des Geometrietyps (punkt,-linien oder flächenförmig) erst auf Instanzenebene festgelegt wird.
subclass of: AG ObjektMitGemeinsamerGeometrie
subclass of: Restriction
  cardinality: 1
  on property: position

AG ObjektMitGemeinsamerGeometrie
type: Class
kennung: 02200
comment: Ein AG_ObjektMitGemeinsamerGeometrie ist ein Raumbezogenes Elementarobjekt (AA_REO), dessen Subklassen sich auf der Ebene der Instanzen die Linien- und Punktgeometrie teilen können. Dies wird dadurch erreicht, dass die Objektinstanzen Elemente eines AA_PunktLinienThemas sind, das einen Geometrischen Komplex realisiert, in dem jedoch nur Punkt- und Liniengeometrien als Bestandteile zulässig sind. Die Klasse ist nicht direkt instanziierbar.
subclass of: AA REO

AG Punktobjekt
type: Class
kennung: 02211
comment: Dies ist die Basisklasse für raumbezogene Fachobjekte, die geometrisch durch einen Punkt repräsentiert werden und sich mit anderen raumbezogenen Fachobjekten des gleichen AA_PunktLinienThemas Punktgeometrie teilen.
subclass of: AG ObjektMitGemeinsamerGeometrie
subclass of: Restriction
  cardinality: 1
  on property: position

AP_Darstellung
type: Class
kennung: 02350
comment: 'AP_Darstellung' ist ein Präsentationsobjekt ohne eigene Geometrie mit Angaben zur Steuerung und Darstellung von Signaturen. Angaben der Signaturenkataloge zur Darstellung der Fachobjekte können vollständig übernommen oder geändert werden, wenn der Signaturenkatalog es zulässt. Durch den Verweis dientZurDarstellungVon gibt das Präsentationsobjekt an, zu wessen Präsentation es dient. Das Ziel der Relation darf nicht wiederum ein Präsentationsobjekt oder ein AA_Objekt vom Typ AP_GPO sein.
subclass of: AA NREO
subclass of: Restriction
  max cardinality: 1
  on property: signaturnummer
subclass of: Restriction
  max cardinality: 1
  on property: darstellungsprioritaet
subclass of: Restriction
  max cardinality: 1
  on property: art
subclass of: Restriction
  max cardinality: 1
  on property: positionierungsregel

AP_FPO
type: Class
kennung: 02330
comment: 'AP_FPO' ist ein flächenförmiges Präsentationsobjekt mit Angaben zur Steuerung der Signaturierung durch Flächensymbole. Sie werden gebildet, wenn - die Standardpräsentation eines Objekts zur Laufzeit umgangen werden soll, da der Signaturenkatalog alternativ die Führung von AP_FPO zulässt oder - die Ableitungsregeln des Signaturenkatalogs die Existenz eines AP_FPO voraussetzt (z. B. ATKIS bei AX_Schleuse). Durch den Verweis dientZurDarstellungVon gibt das Präsentationsobjekt in der Regel an, zu wessen Präsentation es dient. In ATKIS gibt es "freie Präsentationsobjekte", die keinen Verweis tragen. Das Ziel der Relation darf nicht wiederum ein Präsentationsobjekt oder ein AA_Objekt vom Typ AP_GPO sein. Das Objekt wird geometrisch durch eine Fläche beschrieben.
subclass of: AU Flaechenobjekt
subclass of: Restriction
  max cardinality: 1
  on property: signaturnummer
subclass of: Restriction
  max cardinality: 1
  on property: darstellungsprioritaet
subclass of: Restriction
  max cardinality: 1
  on property: art

AP KPO 3D
type: Class
kennung: 02366
comment: Das 3D Präsentationsobjekt AP_KPO_3D wird für 3D Symbole verwendet deren 3D Geometrie in einem externen Datenformat gespeichert wird und über eine URI referenziert wird. AP_KPO_3D leitet sich AU_Punktobjekt_3D und seine 3D Punktgeometrie positioniert das Symbol. Über eine Transformationsmatrix wird die lageunabhängige 3D Geometrie in dem externen Datenformat in den Raumbezug des Präsentationsobjekt AP_KPO_3D transformiert.
subclass of: AU Punktobjekt 3D
subclass of: Restriction
  max cardinality: 1
  on property: signaturnummer
subclass of: Restriction
  max cardinality: 1
  on property: darstellungsprioritaet
subclass of: Restriction
  max cardinality: 1
  on property: art
subclass of: Restriction
  all values from: ap-dateityp-3d
  cardinality: 1
  on property: dateiTyp
subclass of: Restriction
  cardinality: 1
  on property: referenzZumFremdobjekt
subclass of: Restriction
  max cardinality: 1
  on property: transformationsMatrix

AP_LPO
type: Class
kennung: 02320
comment: 'AP_LPO' ist ein linienförmiges Präsentationsobjekt mit Angaben zur Steuerung der Signaturierung durch Liniensymbole. Sie werden gebildet, wenn - die Standardpräsentation eines Objekts zur Laufzeit umgangen werden soll, da der Signaturenkatalog alternativ die Führung von AP_LPO zulässt (z.B. ALKIS: AX_SchifffahrtslinieFaehrverkehr. ATKIS: Darstellung von Brückenflügel). oder - die Ableitungsregeln des Signaturenkatalogs die Existenz eines AP_LPO voraussetzt (z.B. ALKIS Zuordnungspfeile). Durch den Verweis dientZurDarstellungVon gibt das Präsentationsobjekt in der Regel an, zu wessen Präsentation es dient. In ATKIS gibt es "freie Präsentationsobjekte", die keinen Verweis tragen. Das Ziel der Relation darf nicht wiederum ein Präsentationsobjekt oder ein AA_Objekt vom Typ AP_GPO sein. Das Objekt kann geometrisch durch ein Set von Linien beschrieben werden (Anwendungsfall: z. B. Felssignatur).
subclass of: AU Linienobjekt
subclass of: Restriction
  max cardinality: 1
  on property: signaturnummer
subclass of: Restriction
  max cardinality: 1
  on property: darstellungsprioritaet
subclass of: Restriction
  max cardinality: 1
  on property: art
subclass of: Restriction
  max cardinality: 1
  on property: inversZu hat AP PTO
subclass of: Restriction
  max cardinality: 1
  on property: inversZu hat AP LTO

AP_LTO
type: Class
kennung: 02342
comment: 'AP_LTO' ist ein Präsentationsobjekt mit linienförmiger Textgeometrie und Angaben zur Steuerung und Darstellung von Texten. Dabei werden in ATKIS alle Schriften auf der Grundlage der Signaturenkataloge als Präsentationsobjekte gespeichert, in ALKIS diejenigen, die nicht vollautomatisch für einen bestimmten Zielmaßstab einer Karte erzeugt und platziert werden können. Durch den Verweis dientZurDarstellungVon gibt das Präsentationsobjekt in der Regel an, zu wessen Präsentation es dient. In ATKIS gibt es "freie Präsentationsobjekte", die keinen Verweis tragen. Das Ziel der Relation darf nicht wiederum ein Präsentationsobjekt oder ein AA_Objekt vom Typ AP_GPO sein. Das Objekt kann geometrisch durch eine oder mehrere aufeinander folgende Linien modelliert werden.
subclass of: AU KontinuierlichesLinienobjekt
subclass of: Restriction
  max cardinality: 1
  on property: schriftinhalt
subclass of: Restriction
  cardinality: 1
  on property: fontSperrung
subclass of: Restriction
  cardinality: 1
  on property: skalierung
subclass of: Restriction
  all values from: ap-horizontaleausrichtung
  cardinality: 1
  on property: horizontaleAusrichtung
subclass of: Restriction
  all values from: ap-vertikaleausrichtung
  cardinality: 1
  on property: vertikaleAusrichtung
subclass of: Restriction
  max cardinality: 1
  on property: hat
subclass of: Restriction
  max cardinality: 1
  on property: signaturnummer
subclass of: Restriction
  max cardinality: 1
  on property: darstellungsprioritaet
subclass of: Restriction
  max cardinality: 1
  on property: art

AP_PPO
type: Class
kennung: 02310
comment: 'AP_PPO' ist ein punktförmiges Präsentationsobjekt mit Angaben zur Steuerung der Signaturierung durch Symbole. Sie werden gebildet, wenn - die Standardpräsentation eines Objekts zur Laufzeit umgangen werden soll, da der Signaturenkatalog alternativ die Führung von AP_PPO zulässt (z.B. ALKIS Kranken¬haussymbol bei Gebäuden) oder - von der im Signaturenkatalog als Standardpräsentation vorgesehene Signatur in der Größe, der Ausrichtung oder der Verortung abgewichen werden soll. Durch den Verweis dientZurDarstellungVon gibt das Präsentationsobjekt in der Regel an, zu wessen Präsentation es dient. In ATKIS gibt es „freie Präsentationsobjekte“, die keinen Verweis tragen. Das Ziel der Relation darf nicht wiederum ein Präsentationsobjekt oder ein AA_Objekt vom Typ AP_GPO sein. Als Geometrieform ist sowohl ein punktförmiges Objekt mit einer als auch mit mehreren Punktgeometrien zulässig.
subclass of: AU Punkthaufenobjekt
subclass of: Restriction
  max cardinality: 1
  on property: signaturnummer
subclass of: Restriction
  max cardinality: 1
  on property: darstellungsprioritaet
subclass of: Restriction
  max cardinality: 1
  on property: art
subclass of: Restriction
  max cardinality: 1
  on property: drehwinkel
subclass of: Restriction
  max cardinality: 1
  on property: skalierung

AP_PTO
type: Class
kennung: 02341
comment: 'AP_PTO' ist ein Präsentationsobjekt mit punktförmiger Geometrie und Angaben zur Steuerung und Darstellung von Texten. Dabei werden in ATKIS alle Schriften auf der Grundlage der Signaturenkataloge als Präsentationsobjekte gespeichert, in ALKIS diejenigen, die nicht vollautomatisch für einen bestimmten Zielmaßstab einer Karte erzeugt und platziert werden können. Durch den Verweis dientZurDarstellungVon gibt das Präsentationsobjekt in der Regel an, zu wessen Präsentation es dient. In ATKIS gibt es "freie Präsentationsobjekte", die keinen Verweis tragen. Das Ziel der Relation darf nicht wiederum ein Präsentationsobjekt oder ein AA_Objekt vom Typ AP_GPO sein. Das Objekt wird geometrisch durch einen Punkt beschrieben, der auch Bezugspunkt zur Ausrichtung des Textes ist.
subclass of: AU Punktobjekt
subclass of: Restriction
  max cardinality: 1
  on property: schriftinhalt
subclass of: Restriction
  cardinality: 1
  on property: fontSperrung
subclass of: Restriction
  cardinality: 1
  on property: skalierung
subclass of: Restriction
  all values from: ap-horizontaleausrichtung
  cardinality: 1
  on property: horizontaleAusrichtung
subclass of: Restriction
  all values from: ap-vertikaleausrichtung
  cardinality: 1
  on property: vertikaleAusrichtung
subclass of: Restriction
  max cardinality: 1
  on property: hat
subclass of: Restriction
  max cardinality: 1
  on property: signaturnummer
subclass of: Restriction
  max cardinality: 1
  on property: darstellungsprioritaet
subclass of: Restriction
  max cardinality: 1
  on property: art
subclass of: Restriction
  max cardinality: 1
  on property: drehwinkel

AP TransformationsMatrix 3D
type: Class
kennung: 02367
comment: Matrix mit den Transformationsparametern für die Überführung des 3D Symbol in den Raumbezug des Präsentationsobjekts.
subclass of: AbstractObject

AU Flaechenobjekt
type: Class
kennung: 02114
comment: Fachobjekt, das geometrisch durch Flächen beschrieben wird.
subclass of: AU ObjektMitUnabhaengigerGeometrie
subclass of: Restriction
  cardinality: 1
  on property: position

AU GeometrieObjekt 3D
type: Class
kennung: 02402
comment: Das 3D Fachobjekt 'AU_ GeometrieObjekt_3D' erlaubt es, Subklassen zu bilden, bei denen die konkrete Art des 3D Geometrietyps erst auf Instanzenebene z.B. in Abhängigkeit von der Detaillierungsstufe (Level of Detail) festgelegt wird (z.B. Mauern die durch 3D Flächen oder detaillierter durch 3D Körper repräsentiert werden können.
subclass of: AU_ObjektMitUnabhaengigerGeometrie_3D
subclass of: Restriction
  cardinality: 1
  on property: position

AU KoerperObjekt 3D
type: Class
kennung: 02404
comment: 3D Fachobjekt, das geometrisch durch 3D Körper beschrieben wird.
subclass of: AU_ObjektMitUnabhaengigerGeometrie_3D
subclass of: Restriction
  cardinality: 1
  on property: position

AU KontinuierlichesLinienobjekt
type: Class
kennung: 02113
comment: Fachobjekt, das geometrisch durch zusammenhängende Linien beschrieben wird, die sich nicht kreuzen und nicht überlagern. Anwendungsfall: z.B. Leitung.
subclass of: AU ObjektMitUnabhaengigerGeometrie
subclass of: Restriction
  cardinality: 1
  on property: position

AU Linienobjekt
type: Class
kennung: 02112
comment: Fachobjekt, das geometrisch durch einen Set von Linien beschrieben wird (Anwendungsfall: z.B. Felssignatur).
subclass of: AU ObjektMitUnabhaengigerGeometrie
subclass of: Restriction
  cardinality: 1
  on property: position

AU MehrfachFlaechenObjekt 3D
type: Class
kennung: 02401
comment: 3D Fachobjekt, das geometrisch durch 3D Flächen beschrieben wird. Es sind mehrere getrennt liegende 3D Flächen zulässig.
subclass of: AU_ObjektMitUnabhaengigerGeometrie_3D
subclass of: Restriction
  cardinality: 1
  on property: position

AU MehrfachLinienObjekt 3D
type: Class
kennung: 02405
comment: 3D Fachobjekt, das geometrisch durch 3D Linien beschrieben wird. Es sind mehrere getrennt liegende 3D Linien zulässig.
subclass of: AU_ObjektMitUnabhaengigerGeometrie_3D
subclass of: Restriction
  cardinality: 1
  on property: position

AU Objekt
type: Class
kennung: 02110
comment: Der Auswahldatentyp "AU_Objekt" erlaubt es, Subklassen zu bilden, bei denen die konkrete Art des Geometrietyps erst auf Instanzenebene festgelegt wird. Damit ist es z.B. möglich, eine Objektart "Turm" zu bilden, die in Abhängigkeit von der Ausdehnung in der Realwelt punktförmige oder flächenförmige Geometrie hat.
subclass of: AU ObjektMitUnabhaengigerGeometrie
subclass of: Restriction
  cardinality: 1
  on property: position

AU ObjektMitUnabhaengigerGeometrie
type: Class
kennung: 02100
comment: "AU_ObjektMitUnabhaengigerGeometrie" ist die Oberklasse zu den fünf Klassen mit unabhängiger Geometrie. Ein "AU_ObjektMitUnabhaengigerGeometrie" ist ein Raumbezogenes Elementarobjekt (AA_REO), dessen Subklassen sich auf der Ebene der Instanzen keine Geometrie teilen dürfen. Die Klasse ist nicht direkt instanziierbar.
subclass of: AA REO

AU_ObjektMitUnabhaengigerGeometrie_3D
type: Class
kennung: 02400
comment: 'AU_ObjektMitUnabhaengigerGeometrie_3D' ist die Oberklasse zu den acht Klassen mit unabhängiger 3D Geometrie. Die Klasse ist nicht direkt instanziierbar.
subclass of: AA REO

AU PunkthaufenObjekt 3D
type: Class
kennung: 02415
comment: 3D Fachobjekt, das geometrisch durch einen 3D Punkthaufen repräsentiert wird.
subclass of: AU_ObjektMitUnabhaengigerGeometrie_3D
subclass of: Restriction
  cardinality: 1
  on property: position

AU Punkthaufenobjekt
type: Class
kennung: 02115
comment: Objekt, das geometrisch durch einen Punkt oder einen Punkthaufen repräsentiert wird.
subclass of: AU ObjektMitUnabhaengigerGeometrie
subclass of: Restriction
  cardinality: 1
  on property: position

AU Punktobjekt
type: Class
kennung: 02111
comment: Fachobjekt, das geometrisch durch einen einzelnen Punkt repräsentiert wird.
subclass of: AU ObjektMitUnabhaengigerGeometrie
subclass of: Restriction
  cardinality: 1
  on property: position

AU Punktobjekt 3D
type: Class
kennung: 02411
comment: 3D Fachobjekt, das geometrisch durch einen einzelnen 3D Punkt repräsentiert wird.
subclass of: AU_ObjektMitUnabhaengigerGeometrie_3D
subclass of: Restriction
  cardinality: 1
  on property: position

AU TrianguliertesOberflaechenObjekt 3D
type: Class
kennung: 02406
comment: 3D Fachobjekt, das geometrisch durch räumlich zusammenhängende 3D Flächen beschrieben wird, die eine triangulierte Oberfläche (TIN) definieren (z.B. eine Geländeoberfläche).
subclass of: AU_ObjektMitUnabhaengigerGeometrie_3D
subclass of: Restriction
  cardinality: 1
  on property: position

AU UmringObjekt 3D
type: Class
kennung: 02407
comment: 3D Fachobjekt, das geometrisch durch ein 3D Umringspolygon beschrieben wird und weitere 3D Umringspolygone für Enklaven aufweisen kann.
subclass of: AU_ObjektMitUnabhaengigerGeometrie_3D
subclass of: Restriction
  cardinality: 1
  on property: position

Abgeleitete Höhenlinie
type: Class
grunddatenbestand: DHM
kennung: 63020
modellart: Basis-DLM
modellart: DHM
modellart: DLM50
comment: 'Abgeleitete Höhenlinie' ist eine aus einem DGM abgeleitete Höhenlinie für einen bestimmten Massstab.
subclass of: AU Linienobjekt
subclass of: Restriction
  cardinality: 1
  on property: hoehe
subclass of: Restriction
  max cardinality: 1
  on property: aktualisierungsdatum
subclass of: Restriction
  max cardinality: 1
  on property: erfassungsdatum
subclass of: Restriction
  max cardinality: 1
  on property: genauigkeit
subclass of: Restriction
  max cardinality: 1
  on property: massstabszahl

Abschlussfläche 3D
type: Class
kennung: 101002
modellart: LoD2
modellart: LoD3
comment: 'Abschlussfläche 3D' ist eine nicht sichtbare 'Begrenzungsfläche 3D', z. B. Öffnung eines Carports.
subclass of: Begrenzungsfläche 3D

Abschnitt
type: Class
kennung: 56003
modellart: Basis-DLM
comment: 'Abschnitt' ist ein gerichteter Teil des Straßennetzes, der zwischen zwei aufeinanderfolgenden Netzknoten liegt. Er wird durch die in den Netzknoten festgelegten Nullpunkte begrenzt.
subclass of: AU KontinuierlichesLinienobjekt
subclass of: Restriction
  all values from: ax-ergebnisderueberpruefung-bauwerkeeinrichtungenundsonstigeangaben
  max cardinality: 1
  on property: ergebnisDerUeberpruefung
subclass of: Restriction
  max cardinality: 1
  on property: qualitaetsangaben
subclass of: Restriction
  cardinality: 1
  on property: bezeichnung

Andere Festlegung nach Straßenrecht
type: Class
kennung: 71002
modellart: DLKM
comment: 'Andere Festlegung nach Straßenrecht' ist die auf den Grund und Boden bezogene Beschränkung, Belastung oder andere Eigenschaft einer Fläche nach öffentlichen, straßenrechtlichen Vorschriften.
subclass of: AU Objekt
subclass of: Restriction
  all values from: ax-artderfestlegung-anderefestlegungnachstrassenrecht
  cardinality: 1
  on property: artDerFestlegung
subclass of: Restriction
  max cardinality: 1
  on property: ausfuehrendeStelle
subclass of: Restriction
  max cardinality: 1
  on property: nummer
subclass of: Restriction
  max cardinality: 1
  on property: qualitaetsangaben

Andere Festlegung nach Wasserrecht
type: Class
kennung: 71004
modellart: Basis-DLM
modellart: DLKM
comment: 'Andere Festlegung nach Wasserrecht' ist die auf den Grund und Boden bezogene Beschränkung, Belastung oder andere Eigenschaft einer Fläche nach öffentlichen, wasserrechtlichen Vorschriften.
subclass of: AU Flaechenobjekt
subclass of: Restriction
  all values from: ax-artderfestlegung-anderefestlegungnachwasserrecht
  cardinality: 1
  on property: artDerFestlegung
subclass of: Restriction
  max cardinality: 1
  on property: ausfuehrendeStelle
subclass of: Restriction
  max cardinality: 1
  on property: nummer
subclass of: Restriction
  max cardinality: 1
  on property: qualitaetsangaben

AX Anliegervermerk
type: Class
kennung: 111004
modellart: DLKM
subclass of: AbstractObject

Anschrift
type: Class
grunddatenbestand: DLKM
kennung: 21003
modellart: Basis-DLM
modellart: DFGM
modellart: DLKM
modellart: DLM50
comment: 'Anschrift' ist die postalische Adresse, verbunden mit weiteren Adressen aus dem Bereich elektronischer Kommunikationsmedien.
subclass of: AA NREO
subclass of: Restriction
  cardinality: 1
  on property: ort Post
subclass of: Restriction
  max cardinality: 1
  on property: postleitzahlPostzustellung
subclass of: Restriction
  max cardinality: 1
  on property: postleitzahlPostfach
subclass of: Restriction
  max cardinality: 1
  on property: bestimmungsland
subclass of: Restriction
  max cardinality: 1
  on property: ortsteil
subclass of: Restriction
  max cardinality: 1
  on property: strasse
subclass of: Restriction
  max cardinality: 1
  on property: hausnummer
subclass of: Restriction
  max cardinality: 1
  on property: ort AmtlichesOrtsnamensverzeichnis
subclass of: Restriction
  max cardinality: 1
  on property: postfach
subclass of: Restriction
  max cardinality: 1
  on property: qualitaetsangaben

Anteil
type: Class
grunddatenbestand: DLKM
kennung: 21009
modellart: DLKM
comment: 'Anteil' ist ein relativer Anteil an einer Buchungsstelle oder Namensnummer, ausgedrückt als rationale Zahl.
subclass of: AbstractObject

Ast
type: Class
kennung: 56004
modellart: Basis-DLM
comment: 'Ast' ist ein Teil des Straßennetzes, der zur Verknüpfung der Abschnitte untereinander dient und deshalb Teil des Netzknotens ist. Er wird durch die im Netzknoten festgelegten Nullpunkte begrenzt.
subclass of: AU KontinuierlichesLinienobjekt
subclass of: Restriction
  all values from: ax-ergebnisderueberpruefung-bauwerkeeinrichtungenundsonstigeangaben
  max cardinality: 1
  on property: ergebnisDerUeberpruefung
subclass of: Restriction
  max cardinality: 1
  on property: qualitaetsangaben
subclass of: Restriction
  cardinality: 1
  on property: bezeichnung

Aufnahmepunkt
type: Class
grunddatenbestand: DLKM
kennung: 13001
modellart: DLKM
comment: 'Aufnahmepunkt' ist ein Punkt des Lagefestpunktfeldes - Aufnahmepunktfeld und dient der örtlichen Aufnahme von Objektpunkten. Das Aufnahmepunktfeld ist eine Verdichtungsstufe des Lagefestpunktfeldes - Trigonometrisches Festpunktfeld (Grundlagenvermessung).
subclass of: Netzpunkt

AX Auszug
type: Class
kennung: 15005
modellart: DLKM
subclass of: AbstractObject

Bahnstrecke
type: Class
grunddatenbestand: Basis-DLM
grunddatenbestand: DLM50
kennung: 42014
modellart: Basis-DLM
modellart: DLKM
modellart: DLM1000
modellart: DLM250
modellart: DLM50
comment: 'Bahnstrecke' ist ein bestimmter, mit einem Namen und/oder einer Nummer bezeichneter Abschnitt im Netz der schienengebundenen Verkehrswege. Bahnstrecken können aus einem oder zwei Gleisen bestehen.
subclass of: TA CurveComponent
subclass of: Restriction
  all values from: ax-bahnkategorie-bahnstrecke
  min cardinality: 1
  on property: bahnkategorie
subclass of: Restriction
  all values from: ax-elektrifizierung
  cardinality: 1
  on property: elektrifizierung
subclass of: Restriction
  all values from: ax-anzahlderstreckengleise
  cardinality: 1
  on property: anzahlDerStreckengleise
subclass of: Restriction
  max cardinality: 1
  on property: name
subclass of: Restriction
  all values from: ax-spurweite
  max cardinality: 2
  min cardinality: 1
  on property: spurweite
subclass of: Restriction
  all values from: ax-zustand
  max cardinality: 1
  on property: zustand
subclass of: Restriction
  all values from: ax-verkehrsdienst-bahnstrecke
  max cardinality: 1
  on property: verkehrsdienst

Bahnverkehr
type: Class
grunddatenbestand: Basis-DLM
grunddatenbestand: DLKM
grunddatenbestand: DLM50
kennung: 42010
modellart: Basis-DLM
modellart: DLKM
modellart: DLM250
modellart: DLM50
comment: 'Bahnverkehr' umfasst alle für den Schienenverkehr erforderlichen Flächen und die dem Schienenverkehr dienenden bebauten und unbebauten Flächen.
subclass of: AX TatsaechlicheNutzung
subclass of: Restriction
  all values from: ax-funktion-bahnverkehr
  max cardinality: 1
  on property: funktion
subclass of: Restriction
  max cardinality: 1
  on property: bezeichnung
subclass of: Restriction
  max cardinality: 1
  on property: nummerDerBahnstrecke
subclass of: Restriction
  max cardinality: 1
  on property: zweitname
subclass of: Restriction
  all values from: ax-zustand-bahnverkehr
  max cardinality: 1
  on property: zustand

Bahnverkehrsanlage
type: Class
grunddatenbestand: Basis-DLM
grunddatenbestand: DLM50
kennung: 53004
modellart: Basis-DLM
modellart: DLKM
modellart: DLM1000
modellart: DLM250
modellart: DLM50
comment: 'Bahnverkehrsanlage' ist eine Fläche mit Einrichtungen zur Abwicklung des Personen- und/oder Güterverkehrs bei Schienenbahnen oder Schwebebahnen. Dazu gehören das Empfangsgebäude, sonstige räumlich angegliederte Verwaltungs- und Lagergebäude, bahntechnische Einrichtungen, Freiflächen und Gleisanlagen. Die 'Bahnverkehrsanlage' der Eisenbahnen beginnt oder endet im Allgemeinen am Einfahrtssignal oder an der Einfahrtsweiche.
subclass of: AU Objekt
subclass of: Restriction
  all values from: ax-ergebnisderueberpruefung-bauwerkeeinrichtungenundsonstigeangaben
  max cardinality: 1
  on property: ergebnisDerUeberpruefung
subclass of: Restriction
  max cardinality: 1
  on property: qualitaetsangaben
subclass of: Restriction
  all values from: ax-bahnhofskategorie-bahnverkehrsanlage
  cardinality: 1
  on property: bahnhofskategorie
subclass of: Restriction
  max cardinality: 1
  on property: name
subclass of: Restriction
  max cardinality: 1
  on property: bezeichnung
subclass of: Restriction
  all values from: ax-zustand-bahnverkehrsanlage
  max cardinality: 1
  on property: zustand
subclass of: Restriction
  all values from: ax-verkehrsdienst-bahnverkehrsanlage
  max cardinality: 1
  on property: verkehrsdienst

Bau-, Raum- oder Bodenordnungsrecht
type: Class
grunddatenbestand: DLKM
kennung: 71008
modellart: DLKM
comment: 'Bau-, Raum- oder Bodenordnungsrecht' ist ein fachlich übergeordnetes Gebiet von Flächen mit bodenbezogenen Beschränkungen, Belastungen oder anderen Eigenschaften nach öffentlichen Vorschriften.
subclass of: AU Flaechenobjekt
subclass of: Restriction
  all values from: ax-artderfestlegung-bauraumoderbodenordnungsrecht
  cardinality: 1
  on property: artDerFestlegung
subclass of: Restriction
  max cardinality: 1
  on property: ausfuehrendeStelle
subclass of: Restriction
  max cardinality: 1
  on property: name
subclass of: Restriction
  max cardinality: 1
  on property: bezeichnung
subclass of: Restriction
  max cardinality: 1
  on property: veraenderungOhneRuecksprache
subclass of: Restriction
  max cardinality: 1
  on property: datumAnordnung
subclass of: Restriction
  max cardinality: 1
  on property: datumBesitzeinweisung
subclass of: Restriction
  max cardinality: 1
  on property: datumRechtskraeftig
subclass of: Restriction
  max cardinality: 1
  on property: datumAbgabe
subclass of: Restriction
  max cardinality: 1
  on property: qualitaetsangaben

AX BauRaumOderBodenordnungsrechtGrundbuch
type: Class
grunddatenbestand: DLKM
kennung: 111002
modellart: DLKM
subclass of: AA NREO
subclass of: Restriction
  cardinality: 1
  on property: lebenszeitintervallBauRaumOderBodenordnungsrecht
subclass of: Restriction
  max cardinality: 1
  on property: anlassBauRaumOderBodenordnungsrecht
subclass of: Restriction
  all values from: ax-artderfestlegung-bauraumoderbodenordnungsrecht
  cardinality: 1
  on property: artDerFestlegung
subclass of: Restriction
  max cardinality: 1
  on property: ausfuehrendeStelle
subclass of: Restriction
  max cardinality: 1
  on property: ausfuehrendeStelleBezeichnung
subclass of: Restriction
  max cardinality: 1
  on property: name
subclass of: Restriction
  max cardinality: 1
  on property: bezeichnung
subclass of: Restriction
  max cardinality: 1
  on property: datumAnordnung
subclass of: Restriction
  max cardinality: 1
  on property: datumBesitzeinweisung
subclass of: Restriction
  max cardinality: 1
  on property: datumRechtskraeftig
subclass of: Restriction
  max cardinality: 1
  on property: datumAbgabe
subclass of: Restriction
  cardinality: 1
  on property: istEinVerweisAufBauRaumOderBodenordnungsrecht

Baublock
type: Class
kennung: 75001
modellart: DLKM
comment: 'Baublock' ist ein Teil der Erdoberfläche, der von einer festgelegten Grenzlinie umschlossen ist und Teile einer Gemeinde definiert.
subclass of: AU Flaechenobjekt
subclass of: Restriction
  cardinality: 1
  on property: baublockbezeichnung
subclass of: Restriction
  all values from: ax-art-baublock
  max cardinality: 1
  on property: art

Bauteil
type: Class
kennung: 31002
modellart: Basis-DLM
modellart: DLKM
comment: 'Bauteil' ist ein charakteristisches Merkmal eines Gebäudes mit gegenüber dem jeweiligen Objekt 'Gebäude' abweichenden bzw. besonderen Eigenschaften.
subclass of: AG Flaechenobjekt
subclass of: Restriction
  max cardinality: 1
  on property: anzahlDerOberirdischenGeschosse
subclass of: Restriction
  max cardinality: 1
  on property: anzahlDerUnterirdischenGeschosse
subclass of: Restriction
  all values from: ax-dachform
  max cardinality: 1
  on property: dachform
subclass of: Restriction
  max cardinality: 1
  on property: umbauterRaum
subclass of: Restriction
  all values from: ax-lagezurerdoberflaeche-gebaeude
  max cardinality: 1
  on property: lageZurErdoberflaeche
subclass of: Restriction
  max cardinality: 1
  on property: dachart
subclass of: Restriction
  max cardinality: 1
  on property: qualitaetsangaben
subclass of: Restriction
  all values from: ax-bauart-bauteil
  cardinality: 1
  on property: bauart
subclass of: Restriction
  max cardinality: 1
  on property: durchfahrtshoehe

Bauteil 3D
type: Class
kennung: 101001
modellart: LoD1
modellart: LoD2
modellart: LoD3
comment: 'Bauteil 3D' ist ein charakteristisches Merkmal eines Gebäudes oder eines Gebäudeteils.
subclass of: AU GeometrieObjekt 3D
subclass of: Restriction
  max cardinality: 1
  on property: durchfahrtshoehe
subclass of: Restriction
  max cardinality: 1
  on property: qualitaetBodenhoehe
subclass of: Restriction
  max cardinality: 1
  on property: qualitaetDachhoehe
subclass of: Restriction
  max cardinality: 1
  on property: anzahlDerOberirdischenGeschosse
subclass of: Restriction
  max cardinality: 1
  on property: anzahlDerUnterirdischenGeschosse
subclass of: Restriction
  all values from: ax-dachform
  max cardinality: 1
  on property: dachform
subclass of: Restriction
  max cardinality: 1
  on property: umbauterRaum
subclass of: Restriction
  all values from: ax-lagezurerdoberflaeche-gebaeude
  max cardinality: 1
  on property: lageZurErdoberflaeche
subclass of: Restriction
  max cardinality: 1
  on property: dachart
subclass of: Restriction
  max cardinality: 1
  on property: qualitaetsangaben
subclass of: Restriction
  max cardinality: 1
  on property: beziehtSichAuf

AX Bauwerk3D
type: Class
kennung: 102001
modellart: LoD1
modellart: LoD2
modellart: LoD3
comment: Objekte der Objektart 'Bauwerk3D' sind Bauwerke, Einrichtungen oder Anlagen mit 3-dimensionalen geometrischen Eigenschaften.
subclass of: AU GeometrieObjekt 3D
subclass of: Restriction
  max cardinality: 1
  on property: qualitaetBodenhoehe
subclass of: Restriction
  max cardinality: 1
  on property: qualitaetDachhoehe
subclass of: Restriction
  max cardinality: 1
  on property: beziehtSichAuf AX Leitung
subclass of: Restriction
  max cardinality: 1
  on property: beziehtSichAuf AX Netzknoten
subclass of: Restriction
  max cardinality: 1
  on property: beziehtSichAuf AX BauwerkOderAnlageFuerSportFreizeitUndErholung
subclass of: Restriction
  max cardinality: 1
  on property: beziehtSichAuf AX Ast
subclass of: Restriction
  max cardinality: 1
  on property: beziehtSichAuf AX Sickerstrecke
subclass of: Restriction
  max cardinality: 1
  on property: beziehtSichAuf AX EinrichtungInOeffentlichenBereichen
subclass of: Restriction
  max cardinality: 1
  on property: beziehtSichAuf AX Bahnverkehrsanlage
subclass of: Restriction
  max cardinality: 1
  on property: beziehtSichAuf AX Ortslage
subclass of: Restriction
  max cardinality: 1
  on property: beziehtSichAuf AX UntergeordnetesGewaesser
subclass of: Restriction
  max cardinality: 1
  on property: beziehtSichAuf AX Flugverkehrsanlage
subclass of: Restriction
  max cardinality: 1
  on property: beziehtSichAuf AX BauwerkOderAnlageFuerIndustrieUndGewerbe
subclass of: Restriction
  max cardinality: 1
  on property: beziehtSichAuf AX Wasserspiegelhoehe
subclass of: Restriction
  max cardinality: 1
  on property: beziehtSichAuf AX BauwerkImVerkehrsbereich
subclass of: Restriction
  max cardinality: 1
  on property: beziehtSichAuf AX SchifffahrtslinieFaehrverkehr
subclass of: Restriction
  max cardinality: 1
  on property: beziehtSichAuf AX Schleuse
subclass of: Restriction
  max cardinality: 1
  on property: beziehtSichAuf AX Transportanlage
subclass of: Restriction
  max cardinality: 1
  on property: beziehtSichAuf AX Grenzuebergang
subclass of: Restriction
  max cardinality: 1
  on property: beziehtSichAuf AX Nullpunkt
subclass of: Restriction
  max cardinality: 1
  on property: beziehtSichAuf AX WegPfadSteig
subclass of: Restriction
  max cardinality: 1
  on property: beziehtSichAuf AX SonstigesBauwerkOderSonstigeEinrichtung
subclass of: Restriction
  max cardinality: 1
  on property: beziehtSichAuf AX Turm
subclass of: Restriction
  max cardinality: 1
  on property: beziehtSichAuf AX Hafen
subclass of: Restriction
  max cardinality: 1
  on property: beziehtSichAuf AX Gewaessermerkmal
subclass of: Restriction
  max cardinality: 1
  on property: beziehtSichAuf AX BauwerkImGewaesserbereich
subclass of: Restriction
  max cardinality: 1
  on property: beziehtSichAuf AX Strassenverkehrsanlage
subclass of: Restriction
  max cardinality: 1
  on property: beziehtSichAuf AX VorratsbehaelterSpeicherbauwerk
subclass of: Restriction
  max cardinality: 1
  on property: beziehtSichAuf AX HistorischesBauwerkOderHistorischeEinrichtung
subclass of: Restriction
  max cardinality: 1
  on property: beziehtSichAuf AX Gleis
subclass of: Restriction
  max cardinality: 1
  on property: beziehtSichAuf AX HeilquelleGasquelle
subclass of: Restriction
  max cardinality: 1
  on property: beziehtSichAuf AX Abschnitt
subclass of: Restriction
  max cardinality: 1
  on property: beziehtSichAuf AX Vegetationsmerkmal
subclass of: Restriction
  max cardinality: 1
  on property: beziehtSichAuf AX Polder
subclass of: Restriction
  max cardinality: 1
  on property: beziehtSichAuf AX EinrichtungenFuerDenSchiffsverkehr
subclass of: Restriction
  max cardinality: 1
  on property: beziehtSichAuf AX Testgelaende
subclass of: Restriction
  max cardinality: 1
  on property: beziehtSichAuf AX Gewaesserstationierungsachse
subclass of: Restriction
  max cardinality: 1
  on property: beziehtSichAuf AX SeilbahnSchwebebahn

Bauwerk im Gewässerbereich
type: Class
grunddatenbestand: Basis-DLM
grunddatenbestand: DLM50
kennung: 53009
modellart: Basis-DLM
modellart: DLKM
modellart: DLM1000
modellart: DLM250
modellart: DLM50
comment: 'Bauwerk im Gewässerbereich' ist ein Bauwerk, mit dem ein Wasserlauf unter einem Verkehrsweg, einem anderen Wasserlauf oder durch einen Berg hindurch geführt wird. Ein 'Bauwerk im Gewässerbereich' dient dem Abfluss oder der Rückhaltung von Gewässern oder als Messeinrichtung zur Feststellung des Wasserstandes oder als Uferbefestigung.
subclass of: AG Objekt
subclass of: Restriction
  all values from: ax-ergebnisderueberpruefung-bauwerkeeinrichtungenundsonstigeangaben
  max cardinality: 1
  on property: ergebnisDerUeberpruefung
subclass of: Restriction
  max cardinality: 1
  on property: qualitaetsangaben
subclass of: Restriction
  all values from: ax-bauwerksfunktion-bauwerkimgewaesserbereich
  cardinality: 1
  on property: bauwerksfunktion
subclass of: Restriction
  max cardinality: 1
  on property: name
subclass of: Restriction
  max cardinality: 1
  on property: bezeichnung
subclass of: Restriction
  all values from: ax-zustand-bauwerkimgewaesserbereich
  max cardinality: 1
  on property: zustand
subclass of: Restriction
  max cardinality: 2
  on property: regionalsprache

Bauwerk im Verkehrsbereich
type: Class
grunddatenbestand: Basis-DLM
grunddatenbestand: DLM50
kennung: 53001
modellart: Basis-DLM
modellart: DLKM
modellart: DLM1000
modellart: DLM250
modellart: DLM50
comment: 'Bauwerk im Verkehrsbereich' ist ein Bauwerk, das dem Verkehr dient.
subclass of: AG Objekt
subclass of: Restriction
  all values from: ax-ergebnisderueberpruefung-bauwerkeeinrichtungenundsonstigeangaben
  max cardinality: 1
  on property: ergebnisDerUeberpruefung
subclass of: Restriction
  max cardinality: 1
  on property: qualitaetsangaben
subclass of: Restriction
  all values from: ax-bauwerksfunktion-bauwerkimverkehrsbereich
  cardinality: 1
  on property: bauwerksfunktion
subclass of: Restriction
  max cardinality: 1
  on property: name
subclass of: Restriction
  max cardinality: 1
  on property: bezeichnung
subclass of: Restriction
  all values from: ax-zustand-bauwerkimverkehrsbereich
  max cardinality: 1
  on property: zustand
subclass of: Restriction
  max cardinality: 1
  on property: durchfahrtshoehe
subclass of: Restriction
  max cardinality: 1
  on property: breiteDesObjekts

Bauwerk oder Anlage für Industrie und Gewerbe
type: Class
grunddatenbestand: Basis-DLM
grunddatenbestand: DLM50
kennung: 51002
modellart: Basis-DLM
modellart: DLKM
modellart: DLM1000
modellart: DLM250
modellart: DLM50
comment: 'Bauwerk oder Anlage für Industrie und Gewerbe' ist ein Bauwerk oder eine Anlage, die überwiegend industriellen und gewerblichen Zwecken dient oder Einrichtung an Ver- und Entsorgungsleitungen ist.
subclass of: AG Objekt
subclass of: Restriction
  all values from: ax-ergebnisderueberpruefung-bauwerkeeinrichtungenundsonstigeangaben
  max cardinality: 1
  on property: ergebnisDerUeberpruefung
subclass of: Restriction
  max cardinality: 1
  on property: qualitaetsangaben
subclass of: Restriction
  all values from: ax-bauwerksfunktion-bauwerkoderanlagefuerindustrieundgewerbe
  cardinality: 1
  on property: bauwerksfunktion
subclass of: Restriction
  max cardinality: 1
  on property: name
subclass of: Restriction
  max cardinality: 1
  on property: bezeichnung
subclass of: Restriction
  all values from: ax-zustand-bauwerkoderanlagefuerindustrieundgewerbe
  max cardinality: 1
  on property: zustand

Bauwerk oder Anlage für Sport, Freizeit und Erholung
type: Class
grunddatenbestand: Basis-DLM
grunddatenbestand: DLM50
kennung: 51006
modellart: Basis-DLM
modellart: DLKM
modellart: DLM250
modellart: DLM50
comment: 'Bauwerk oder Anlage für Sport, Freizeit und Erholung' ist ein Bauwerk oder eine Anlage zur Ausübung von Sport-, Freizeit- und Erholungsaktivitäten.
subclass of: AG Objekt
subclass of: Restriction
  all values from: ax-ergebnisderueberpruefung-bauwerkeeinrichtungenundsonstigeangaben
  max cardinality: 1
  on property: ergebnisDerUeberpruefung
subclass of: Restriction
  max cardinality: 1
  on property: qualitaetsangaben
subclass of: Restriction
  all values from: ax-bauwerksfunktion-bauwerkoderanlagefuersportfreizeitunderholung
  cardinality: 1
  on property: bauwerksfunktion
subclass of: Restriction
  max cardinality: 1
  on property: name
subclass of: Restriction
  max cardinality: 1
  on property: breiteDesObjekts
subclass of: Restriction
  all values from: ax-zustand-bauwerkoderanlagefuersportfreizeitunderholung
  max cardinality: 1
  on property: zustand

Begrenzungsfläche 3D
type: Class
kennung: 101009
modellart: LoD2
modellart: LoD3
comment: 'Begrenzungsfläche 3D' ist eine planare Fläche und Bestandteil des 'Bauteil 3D' sowie des 'Bauwerk 3D'.
subclass of: AU MehrfachFlaechenObjekt 3D
subclass of: Restriction
  max cardinality: 1
  on property: begrenztBauwerk
subclass of: Restriction
  max cardinality: 1
  on property: begrenzt

AX Benutzer
type: Class
kennung: 81001
comment: In der Objektart 'Benutzer' werden allgemeine Informationen über den Benutzer verwaltet.
subclass of: AA Benutzer
subclass of: Restriction
  cardinality: 1
  on property: profilkennung
subclass of: Restriction
  max cardinality: 1
  on property: art
subclass of: Restriction
  max cardinality: 1
  on property: zeitlicheBerechtigung
subclass of: Restriction
  max cardinality: 1
  on property: zahlungsweise
subclass of: Restriction
  max cardinality: 1
  on property: letzteAbgabeZugriff
subclass of: Restriction
  max cardinality: 1
  on property: vorletzteAbgabeZugriff
subclass of: Restriction
  max cardinality: 1
  on property: folgeverarbeitung
subclass of: Restriction
  cardinality: 1
  on property: empfaenger
subclass of: Restriction
  all values from: ax-letzteabgabeart
  max cardinality: 1
  on property: letzteAbgabeArt
subclass of: Restriction
  max cardinality: 1
  on property: nBAUebernahmeErfolgreich
subclass of: Restriction
  max cardinality: 1
  on property: nBAQuittierungErhalten
subclass of: Restriction
  cardinality: 1
  on property: ist
subclass of: Restriction
  cardinality: 1
  on property: gehoertZu

AX Benutzergruppe
type: Class
kennung: 81002
comment: In der 'Benutzergruppe' werden Informationen über die Benutzer der Bestandsdaten verwaltet, die den Umfang der Benutzung und Fortführung aus Gründen der Datenkonsistenz und des Datenschutzes einschränken sowie Standardparameter für die Benutzergruppe vermerken.
subclass of: AA Benutzergruppe
subclass of: Restriction
  cardinality: 1
  on property: bezeichnung
subclass of: Restriction
  cardinality: 1
  on property: zustaendigeStelle
subclass of: Restriction
  max cardinality: 1
  on property: koordinatenreferenzsystem

AX BenutzergruppeMitZugriffskontrolle
type: Class
kennung: 81003
comment: In der Objektart 'Benutzergruppe mit Zugriffskontrolle' werden Informationen über die Benutzer der ALKIS-Bestandsdaten verwaltet, die den Umfang der Benutzung und Fortführung aus Gründen der Datenkonsistenz und des Datenschutzes einschränken.
subclass of: AX Benutzergruppe
subclass of: Restriction
  min cardinality: 1
  on property: selektionskriterien
subclass of: Restriction
  cardinality: 1
  on property: zugriffHistorie

AX BenutzergruppeNBA
type: Class
kennung: 81004
comment: In der Objektart 'Benutzergruppe (NBA)' werden relevante Informationen für die Durchführung der NBA-Versorgung, z.B. die anzuwendenden Selektionskriterien, gespeichert. Eine gesonderte Prüfung der Zugriffsrechte erfolgt in diesem Fall nicht, deren Berücksichtigung ist von dem Administrator bei der Erzeugung und Pflege der NBA-Benutzergruppen sicherzustellen.
subclass of: AX Benutzergruppe
subclass of: Restriction
  min cardinality: 1
  on property: selektionskriterien
subclass of: Restriction
  max cardinality: 1
  on property: bereichZeitlich
subclass of: Restriction
  max cardinality: 1
  on property: portionierungsparameter
subclass of: Restriction
  max cardinality: 1
  on property: quittierung
subclass of: Restriction
  all values from: ax-abgabeversion
  cardinality: 1
  on property: abgabeversion

Bereich - zeitlich
type: Class
kennung: 81005
comment: 'Bereich - zeitlich' bezeichnet den Zeitraum für die Abgabe von Änderungsinformationen und Bestandsdaten.
subclass of: AbstractObject

Bergbaubetrieb
type: Class
grunddatenbestand: Basis-DLM
grunddatenbestand: DLKM
grunddatenbestand: DLM50
kennung: 41004
modellart: Basis-DLM
modellart: DLKM
modellart: DLM50
comment: 'Bergbaubetrieb' ist eine Fläche, die für die Förderung des Abbaugutes unter Tage genutzt wird.
subclass of: AX TatsaechlicheNutzung
subclass of: Restriction
  max cardinality: 1
  on property: name
subclass of: Restriction
  max cardinality: 1
  on property: bezeichnung
subclass of: Restriction
  all values from: ax-abbaugut-bergbaubetrieb
  max cardinality: 1
  on property: abbaugut
subclass of: Restriction
  all values from: ax-zustand-bergbaubetrieb
  max cardinality: 1
  on property: zustand
subclass of: Restriction
  all values from: ax-funktion-bergbaubetrieb
  max cardinality: 1
  on property: funktion

Besondere Flurstücksgrenze
type: Class
grunddatenbestand: DLKM
kennung: 11002
modellart: DLKM
comment: 'Besondere Flurstücksgrenze' ist ein Teil der Grenzlinie eines Flurstücks, der von genau zwei benachbarten Grenzpunkten begrenzt wird und für den besondere Informationen vorliegen.
subclass of: TA CurveComponent
subclass of: Restriction
  all values from: ax-artderflurstuecksgrenze-besondereflurstuecksgrenze
  min cardinality: 1
  on property: artDerFlurstuecksgrenze

Besondere Gebäudelinie
type: Class
kennung: 31003
modellart: DLKM
comment: 'Besondere Gebäudelinie' ist der Teil der Geometrie des Objekts 'Gebäude', des Objekts 'Bauteil' oder eines Objektes 'Bauwerk', der besondere Eigenschaften besitzt.
subclass of: AG Linienobjekt
subclass of: Restriction
  all values from: ax-beschaffenheit-besonderegebaeudelinie
  min cardinality: 1
  on property: beschaffenheit

Besonderer Bauwerkspunkt
type: Class
kennung: 51011
modellart: DLKM
comment: 'Besonderer Bauwerkspunkt' ist ein Punkt eines 'Bauwerks' oder einer 'Einrichtung'.
subclass of: AA ZUSO
subclass of: Restriction
  max cardinality: 1
  on property: punktkennung
subclass of: Restriction
  all values from: ax-art-bauwerkspunkt
  max cardinality: 1
  on property: art
subclass of: Restriction
  max cardinality: 1
  on property: zustaendigeStelle

Besonderer Gebäudepunkt
type: Class
kennung: 31005
modellart: DLKM
comment: 'Besonderer Gebäudepunkt' ist ein Punkt eines 'Gebäudes' oder eines 'Bauteils'.
subclass of: AA ZUSO
subclass of: Restriction
  max cardinality: 1
  on property: punktkennung
subclass of: Restriction
  all values from: ax-art-gebaeudepunkt
  max cardinality: 1
  on property: art
subclass of: Restriction
  max cardinality: 1
  on property: zustaendigeStelle

Besonderer Topographischer Punkt
type: Class
kennung: 61009
modellart: DLKM
comment: 'Besonderer Topographischer Punkt' ist ein im Liegenschaftskataster geführter Topographischer Punkt.
subclass of: AA ZUSO
subclass of: Restriction
  max cardinality: 1
  on property: punktkennung
subclass of: Restriction
  max cardinality: 1
  on property: zustaendigeStelle

Bewertung
type: Class
kennung: 72004
modellart: DLKM
comment: 'Bewertung' ist die Klassifizierung einer Fläche nach dem Bewertungsgesetz (Bewertungsfläche).
subclass of: AG Flaechenobjekt
subclass of: Restriction
  all values from: ax-klassifizierung-bewertung
  cardinality: 1
  on property: klassifizierung
subclass of: Restriction
  max cardinality: 1
  on property: qualitaetsangaben

Bodenfläche 3D
type: Class
kennung: 101003
modellart: LoD2
modellart: LoD3
comment: 'Bodenfläche 3D' ist eine untere Begrenzungsfläche eines 'Bauteil 3D'.
subclass of: Begrenzungsfläche 3D

AX Bodenschaetzung
type: Class
grunddatenbestand: DLKM
kennung: 72001
modellart: DLKM
comment: Bodenschätzung ist die kleinste Einheit einer bodengeschätzten Fläche nach dem BodSchätzG, für die eine Ertragsfähigkeit im Liegenschaftskataster nachzuweisen ist (Bodenschätzungsfläche).
subclass of: TA MultiSurfaceComponent
subclass of: Restriction
  all values from: ax-nutzungsart-bodenschaetzung
  cardinality: 1
  on property: nutzungsart
subclass of: Restriction
  all values from: ax-bodenart-bodenschaetzung
  cardinality: 1
  on property: bodenart
subclass of: Restriction
  all values from: ax-zustandsstufe
  max cardinality: 1
  on property: zustandsstufe
subclass of: Restriction
  all values from: ax-bodenstufe
  max cardinality: 1
  on property: bodenstufe
subclass of: Restriction
  all values from: ax-klimastufe
  max cardinality: 1
  on property: klimastufe
subclass of: Restriction
  all values from: ax-wasserverhaeltnisse
  max cardinality: 1
  on property: wasserverhaeltnisse
subclass of: Restriction
  max cardinality: 1
  on property: bodenzahlOderGruenlandgrundzahl
subclass of: Restriction
  max cardinality: 1
  on property: ackerzahlOderGruenlandzahl
subclass of: Restriction
  max cardinality: 1
  on property: jahreszahl
subclass of: Restriction
  max cardinality: 1
  on property: qualitaetsangaben

Böschung
type: Class
grunddatenbestand: Basis-DLM
grunddatenbestand: DLM50
kennung: 61001
modellart: Basis-DLM
modellart: DHM
modellart: DLKM
modellart: DLM1000
modellart: DLM250
modellart: DLM50
comment: 'Böschung' ist die zwischen zwei verschieden hoch gelegenen Ebenen geneigte Geländeoberfläche künstlichen oder natürlichen Ursprungs. 'Kliff' ist eine aus Lockermaterial oder Festgestein aufgebaute Steilküste.
subclass of: AA ZUSO
subclass of: Restriction
  all values from: ax-zustand-boeschungkliff
  max cardinality: 1
  on property: zustand
subclass of: Restriction
  max cardinality: 1
  on property: objekthoehe
subclass of: Restriction
  max cardinality: 1
  on property: name
subclass of: Restriction
  max cardinality: 1
  on property: qualitaetsangaben

Böschungsfläche
type: Class
grunddatenbestand: Basis-DLM
grunddatenbestand: DLM50
kennung: 61002
modellart: Basis-DLM
modellart: DLKM
modellart: DLM50
comment: 'Böschungsfläche' ist eine durch Geländekanten begrenzte Geländeoberfläche künstlichen oder natürlichen Ursprungs.
subclass of: AG Flaechenobjekt

Buchung
type: Class
kennung: 17004
modellart: DLKM
comment: 'Buchung' ist ein Hinweis auf die 'Buchungsstelle' (und in Verbindung damit auch auf das 'Buchungsblatt'), auf die das Flurstück des Liegenschaftskatasters zum 'Zeitpunkt der Historisierung' verweist.
subclass of: AbstractObject

Buchungsblatt
type: Class
grunddatenbestand: DLKM
kennung: 21007
modellart: DLKM
comment: 'Buchungsblatt' enthält die Buchungen (Buchungsstellen und Namensnummern) des Grundbuchs und des Liegenschaftskatasters (bei buchungsfreien Grundstücken). Das Buchungsblatt für Buchungen im Liegenschaftskataster kann entweder ein Kataster-, Erwerber-, Pseudo- oder ein Fiktives Blatt sein.
subclass of: AA NREO
subclass of: Restriction
  cardinality: 1
  on property: buchungsblattkennzeichen
subclass of: Restriction
  cardinality: 1
  on property: buchungsblattbezirk
subclass of: Restriction
  cardinality: 1
  on property: buchungsblattnummerMitBuchstabenerweiterung
subclass of: Restriction
  all values from: ax-blattart-buchungsblatt
  cardinality: 1
  on property: blattart

Buchungsblattbezirk
type: Class
grunddatenbestand: DLKM
kennung: 73010
modellart: DLKM
comment: 'Buchungsblattbezirk' enthält die Verschlüsselung von Buchungsbezirken mit der entsprechenden Bezeichnung.
subclass of: AA NREO
subclass of: Restriction
  cardinality: 1
  on property: schluesselGesamt
subclass of: Restriction
  cardinality: 1
  on property: bezeichnung
subclass of: Restriction
  max cardinality: 1
  on property: einwohnerzahl
subclass of: Restriction
  max cardinality: 1
  on property: historisch
subclass of: Restriction
  max cardinality: 2
  on property: regionalsprache
subclass of: Restriction
  cardinality: 1
  on property: schluessel
subclass of: Restriction
  max cardinality: 1
  on property: gehoertZu

AX Buchungsblattbezirk Schluessel
type: Class
grunddatenbestand: DLKM
kennung: 73016
modellart: DLKM
comment: Amtliche Verschlüsselung des Buchungsblattbezirks.
subclass of: AbstractObject

Buchungsstelle
type: Class
grunddatenbestand: DLKM
kennung: 21008
modellart: DLKM
comment: 'Buchungsstelle' ist die unter einer laufenden Nummer im Verzeichnis des Buchungsblattes eingetragene Buchung.
subclass of: AA NREO
subclass of: Restriction
  all values from: ax-buchungsart-buchungsstelle
  cardinality: 1
  on property: buchungsart
subclass of: Restriction
  cardinality: 1
  on property: laufendeNummer
subclass of: Restriction
  max cardinality: 1
  on property: anteil
subclass of: Restriction
  max cardinality: 1
  on property: nummerImAufteilungsplan
subclass of: Restriction
  max cardinality: 1
  on property: beschreibungDesSondereigentums
subclass of: Restriction
  max cardinality: 1
  on property: buchungstext
subclass of: Restriction
  max cardinality: 1
  on property: beschreibungDesUmfangsDerBuchung
subclass of: Restriction
  max cardinality: 1
  on property: zeitpunktDerEintragung
subclass of: Restriction
  max cardinality: 1
  on property: eingangDesEintragungsantrags
subclass of: Restriction
  cardinality: 1
  on property: istBestandteilVon

Bundesland
type: Class
grunddatenbestand: Basis-DLM
grunddatenbestand: DFGM
grunddatenbestand: DLKM
grunddatenbestand: DLM50
kennung: 73002
modellart: Basis-DLM
modellart: DFGM
modellart: DLKM
modellart: DLM1000
modellart: DLM250
modellart: DLM50
comment: 'Bundesland' umfasst das Gebiet des jeweiligen Bundeslandes innerhalb der Bundesrepublik Deutschland.
subclass of: AA NREO
subclass of: Restriction
  cardinality: 1
  on property: schluesselGesamt
subclass of: Restriction
  cardinality: 1
  on property: bezeichnung
subclass of: Restriction
  max cardinality: 1
  on property: einwohnerzahl
subclass of: Restriction
  max cardinality: 1
  on property: historisch
subclass of: Restriction
  max cardinality: 2
  on property: regionalsprache
subclass of: Restriction
  cardinality: 1
  on property: schluessel

AX Bundesland Schluessel
type: Class
grunddatenbestand: Basis-DLM
grunddatenbestand: DFGM
grunddatenbestand: DLKM
grunddatenbestand: DLM50
kennung: 73018
modellart: Basis-DLM
modellart: DFGM
modellart: DLKM
modellart: DLM1000
modellart: DLM250
modellart: DLM50
comment: Amtliche Verschlüsselung des Bundeslands.
subclass of: AbstractObject

DHM Gitter
type: Class
grunddatenbestand: DHM
kennung: 63010
modellart: DHM
comment: 'DHM Gitter' ist die Menge der in einem quadratischen Gitter mit einer einheitlichen Gitterweite und Genauigkeit angeordneten, aus den 3D-Erfassungsdaten oder aus anderen Daten abgeleiteten Höhenpunkte.
subclass of: AD GitterCoverage
subclass of: Restriction
  max cardinality: 1
  on property: aktualisierungsdatum
subclass of: Restriction
  all values from: ax-auspraegung
  cardinality: 1
  on property: auspraegung
subclass of: Restriction
  cardinality: 1
  on property: erfassungsdatum
subclass of: Restriction
  max cardinality: 1
  on property: genauigkeit
subclass of: Restriction
  cardinality: 1
  on property: gitterweite

AX DQBodenhoehe
type: Class
kennung: 102002
modellart: LoD1
modellart: LoD2
modellart: LoD3
subclass of: AbstractObject

AX DQDachhoehe
type: Class
kennung: 102003
modellart: LoD1
subclass of: AbstractObject

DQErhebung3D
type: Class
grunddatenbestand: DHM
kennung: 62050
modellart: DHM
modellart: DLKM
comment: 'DQErhebung3D' enthält Angaben zur Herkunft, Genauigkeit und Aktualität der Informationen zu einer dreidimensionalen Information . Die Angaben zur Herkunft sind konform zu den Vorgaben aus ISO 19115 zu repräsentieren.
subclass of: AbstractObject

AX DQFestpunkt
type: Class
grunddatenbestand: DFGM
kennung: 19109
modellart: DFGM
comment: Qualitätsangaben zu den Daten des Festpunkts.
subclass of: AbstractObject

AX DQHoehenfestpunkt
type: Class
grunddatenbestand: DFGM
kennung: 19107
modellart: DFGM
comment: Qualitätsangaben zu den Daten des Höhenfestpunkts.
subclass of: AbstractObject

AX DQMitDatenerhebung
type: Class
grunddatenbestand: DLKM
kennung: 50002
modellart: Basis-DLM
modellart: DHM
modellart: DLKM
modellart: LoD1
modellart: LoD2
modellart: LoD3
comment: Angaben zur Herkunft der Informationen (Erhebungsstelle). Die Information ist konform zu den Vorgaben aus ISO 19115 zu repräsentieren.
subclass of: AbstractObject

AX DQOhneDatenerhebung
type: Class
grunddatenbestand: DLKM
kennung: 21011
modellart: DLKM
comment: Angaben zur Herkunft der Informationen (Erhebungsstelle). Die Information ist konform zu den Vorgaben aus ISO 19115 zu repräsentieren.
subclass of: AbstractObject

DQPunktort
type: Class
grunddatenbestand: DFGM
grunddatenbestand: DLKM
kennung: 14006
modellart: DFGM
modellart: DLKM
comment: 'DQPunktort' enthält Angaben zur Herkunft, Genauigkeit und Vertrauenswürdigkeit der Informationen zu einem Punktort. Die Angaben zur Herkunft sind konform zu den Vorgaben aus ISO 19115 zu repräsentieren.
subclass of: AbstractObject

AX DQSchwere
type: Class
grunddatenbestand: DFGM
kennung: 14011
modellart: DFGM
comment: Qualitätselemente zu AX_Schwere.
subclass of: AbstractObject

Dachfläche 3D
type: Class
kennung: 101004
modellart: LoD2
modellart: LoD3
comment: 'Dachfläche 3D' ist eine obere Begrenzungsfläche eines 'Bauteil 3D', welche einen Dachbestandteil abbildet.
subclass of: Begrenzungsfläche 3D

Damm, Wall, Deich
type: Class
grunddatenbestand: Basis-DLM
grunddatenbestand: DLM50
kennung: 61003
modellart: Basis-DLM
modellart: DLKM
modellart: DLM1000
modellart: DLM250
modellart: DLM50
comment: 'Damm, Wall, Deich' ist eine aus Erde oder anderen Baustoffen bestehende langgestreckte Aufschüttung, die Vegetation tragen kann.
subclass of: AU Objekt
subclass of: Restriction
  all values from: ax-art-dammwalldeich
  max cardinality: 1
  on property: art
subclass of: Restriction
  all values from: ax-funktion-dammwalldeich
  max cardinality: 1
  on property: funktion
subclass of: Restriction
  max cardinality: 1
  on property: bezeichnung
subclass of: Restriction
  max cardinality: 1
  on property: objekthoehe
subclass of: Restriction
  max cardinality: 1
  on property: name
subclass of: Restriction
  all values from: ax-ergebnisderueberpruefung-dammwalldeich
  max cardinality: 1
  on property: ergebnisDerUeberpruefung
subclass of: Restriction
  max cardinality: 1
  on property: qualitaetsangaben

Denkmalschutzrecht
type: Class
grunddatenbestand: Basis-DLM
grunddatenbestand: DLM50
kennung: 71009
modellart: Basis-DLM
modellart: DLKM
modellart: DLM50
comment: 'Denkmalschutzrecht' ist die auf den Grund und Boden bezogene Beschränkung, Belastung oder andere Eigenschaft einer Fläche oder Gegenstand nach öffentlichen, denkmalschutzrechtlichen Vorschriften.
subclass of: AU Objekt
subclass of: Restriction
  all values from: ax-artderfestlegung-denkmalschutzrecht
  cardinality: 1
  on property: artDerFestlegung
subclass of: Restriction
  max cardinality: 1
  on property: ausfuehrendeStelle
subclass of: Restriction
  max cardinality: 1
  on property: name
subclass of: Restriction
  max cardinality: 1
  on property: bezeichnung
subclass of: Restriction
  max cardinality: 1
  on property: qualitaetsangaben

Dienststelle
type: Class
grunddatenbestand: DLKM
kennung: 73011
modellart: Basis-DLM
modellart: DFGM
modellart: DHM
modellart: DLKM
modellart: DLM50
comment: 'Dienststelle' enthält die Verschlüsselung von Dienststellen und ÖbVi/ÖbV, die Aufgaben der öffentlichen Verwaltung wahrnehmen, mit der entsprechenden Bezeichnung.
subclass of: AA NREO
subclass of: Restriction
  cardinality: 1
  on property: schluesselGesamt
subclass of: Restriction
  cardinality: 1
  on property: bezeichnung
subclass of: Restriction
  max cardinality: 1
  on property: einwohnerzahl
subclass of: Restriction
  max cardinality: 1
  on property: historisch
subclass of: Restriction
  max cardinality: 2
  on property: regionalsprache
subclass of: Restriction
  cardinality: 1
  on property: schluessel
subclass of: Restriction
  all values from: ax-behoerde
  max cardinality: 1
  on property: stellenart
subclass of: Restriction
  max cardinality: 1
  on property: kennung
subclass of: Restriction
  max cardinality: 1
  on property: hat

AX Dienststelle Schluessel
type: Class
grunddatenbestand: DLKM
kennung: 73017
modellart: Basis-DLM
modellart: DFGM
modellart: DLKM
modellart: DLM50
comment: Amtliche Verschlüsselung der Dienststelle.
subclass of: AbstractObject

AX Dienststellenlogo
type: Class
kennung: DSL
modellart: DFGM
comment: Die externe Objektart "Dienststellenlogo" enthält das Logo der Dienststelle als Pixelgraphik in einer externen Datei, z.B. im Format PNG.
subclass of: AbstractObject

Düne
type: Class
grunddatenbestand: Basis-DLM
grunddatenbestand: DLM50
kennung: 61007
modellart: Basis-DLM
modellart: DLKM
modellart: DLM50
comment: 'Düne' ist ein vom Wind angewehter Sandhügel.
subclass of: AU Flaechenobjekt
subclass of: Restriction
  max cardinality: 1
  on property: name
subclass of: Restriction
  max cardinality: 1
  on property: qualitaetsangaben

Einrichtung in öffentlichen Bereichen
type: Class
kennung: 51010
modellart: Basis-DLM
modellart: DLKM
comment: 'Einrichtung in öffentlichen Bereichen' sind Gegenstände und Einrichtungen verschiedenster Art in öffentlichen oder öffentlich zugänglichen Bereichen (z. B. Straßen, Parkanlagen).
subclass of: AG Objekt
subclass of: Restriction
  all values from: ax-ergebnisderueberpruefung-bauwerkeeinrichtungenundsonstigeangaben
  max cardinality: 1
  on property: ergebnisDerUeberpruefung
subclass of: Restriction
  max cardinality: 1
  on property: qualitaetsangaben
subclass of: Restriction
  all values from: ax-art-einrichtunginoeffentlichenbereichen
  cardinality: 1
  on property: art
subclass of: Restriction
  max cardinality: 1
  on property: kilometerangabe

Einrichtungen für den Schiffsverkehr
type: Class
grunddatenbestand: Basis-DLM
grunddatenbestand: DLM50
kennung: 53008
modellart: Basis-DLM
modellart: DLKM
modellart: DLM250
modellart: DLM50
comment: 'Einrichtungen für den Schiffsverkehr' ist ein Bauwerk, das dem Schiffsverkehr dient.
subclass of: AU Objekt
subclass of: Restriction
  all values from: ax-ergebnisderueberpruefung-bauwerkeeinrichtungenundsonstigeangaben
  max cardinality: 1
  on property: ergebnisDerUeberpruefung
subclass of: Restriction
  max cardinality: 1
  on property: qualitaetsangaben
subclass of: Restriction
  all values from: ax-art-einrichtungenfuerdenschiffsverkehr
  cardinality: 1
  on property: art
subclass of: Restriction
  max cardinality: 1
  on property: bezeichnung
subclass of: Restriction
  max cardinality: 1
  on property: kilometerangabe
subclass of: Restriction
  max cardinality: 1
  on property: name
subclass of: Restriction
  all values from: ax-zustand-einrichtungenfuerdenschiffsverkehr
  max cardinality: 1
  on property: zustand

Einschnitt
type: Class
kennung: 61004
modellart: Basis-DLM
modellart: DLKM
modellart: DLM50
comment: 'Einschnitt' ist eine langgestreckte Vertiefung, künstlichen oder natürlichen Ursprungs im Gelände, die seitlich durch Böschungen begrenzt wird.
subclass of: AU Linienobjekt
subclass of: Restriction
  all values from: ax-funktion-einschnitt
  max cardinality: 1
  on property: funktion
subclass of: Restriction
  max cardinality: 1
  on property: tiefeVonEinschnitt

AX FGraphik
type: Class
kennung: EFG
modellart: DLKM
comment: Die Externe Objektart "F-Graphik" enthält für die Anlage zum Fortführungsnachweis und zu den Fortführungsmitteilungen in einer externen Datei eine Gegenüberstellung des alten und neuen Bestandes, in der alle Veränderungen farbig gekennzeichnet sind. Das Format dieser externen Datei (z.B. NAS oder GeoTiff) wird durch die Implementierung festgelegt.
subclass of: AbstractObject

AX FOLGEVA
type: Class
kennung: 81007
comment: Der komplexe Datentyp 'FOLGEVA' enthält Parameter, die für die Folgeverarbeitung von (Standard-) Ausgaben benötigt werden.
subclass of: AbstractObject

Fahrbahnachse
type: Class
grunddatenbestand: Basis-DLM
kennung: 42005
modellart: Basis-DLM
modellart: DLKM
comment: 'Fahrbahnachse' beschreibt die Geometrie und Eigenschaften einer Fahrbahn bei mehrbahnigen Straßen. Zur Fahrbahn gehören auch Stand- und Kriechspuren. Die begeh- und befahrbare Fläche einer Fußgängerzone ist als Fahrbahn anzusehen.
subclass of: TA CurveComponent
subclass of: Restriction
  all values from: ax-besonderefahrstreifen
  max cardinality: 1
  on property: besondereFahrstreifen
subclass of: Restriction
  max cardinality: 1
  on property: breiteDerFahrbahn
subclass of: Restriction
  all values from: ax-funktion-fahrbahnachse
  max cardinality: 1
  on property: funktion
subclass of: Restriction
  max cardinality: 1
  on property: anzahlDerFahrstreifen
subclass of: Restriction
  all values from: ax-zustand
  max cardinality: 1
  on property: zustand
subclass of: Restriction
  all values from: ax-oberflaechenmaterial-strasse
  max cardinality: 1
  on property: oberflaechenmaterial
subclass of: Restriction
  max cardinality: 1
  on property: fahrtrichtung

Fahrwegachse
type: Class
grunddatenbestand: Basis-DLM
grunddatenbestand: DLM50
kennung: 42008
modellart: Basis-DLM
modellart: DLKM
modellart: DLM250
modellart: DLM50
comment: 'Fahrwegachse' beschreibt die Geometrie und die Eigenschaften eines Fahrweges. Zum Fahrweg gehören auch Seitenstreifen und Gräben zur Wegentwässerung.
subclass of: TA CurveComponent
subclass of: Restriction
  all values from: ax-befestigung-fahrwegachse
  max cardinality: 1
  on property: befestigung
subclass of: Restriction
  max cardinality: 1
  on property: breiteDesVerkehrsweges
subclass of: Restriction
  all values from: ax-markierung-wegachse
  max cardinality: 2
  on property: markierung
subclass of: Restriction
  max cardinality: 1
  on property: name
subclass of: Restriction
  all values from: ax-funktion-wegachse
  cardinality: 1
  on property: funktion
subclass of: Restriction
  max cardinality: 1
  on property: strassenschluessel
subclass of: Restriction
  all values from: ax-befahrbarkeit-fahrwegachse
  max cardinality: 1
  on property: befahrbarkeit
subclass of: Restriction
  max cardinality: 1
  on property: fahrtrichtung
subclass of: Restriction
  max cardinality: 2
  on property: regionalsprache

AX FarbeRGB Materialeigenschaft Material3D
type: Class
kennung: 103005
modellart: LoD1
modellart: LoD2
modellart: LoD3
comment: Farbdefinition im RGB-Schema
subclass of: AbstractObject

Felsen, Felsblock, Felsnadel
type: Class
grunddatenbestand: Basis-DLM
grunddatenbestand: DLM50
kennung: 61006
modellart: Basis-DLM
modellart: DLKM
modellart: DLM50
comment: 'Felsen, Felsblock, Felsnadel' ist eine aufragende Gesteinsmasse oder ein einzelner großer Stein.
subclass of: AU Objekt
subclass of: Restriction
  max cardinality: 1
  on property: objekthoehe
subclass of: Restriction
  max cardinality: 1
  on property: name
subclass of: Restriction
  max cardinality: 1
  on property: bezeichnung
subclass of: Restriction
  max cardinality: 1
  on property: qualitaetsangaben

Fenster 3D
type: Class
kennung: 101021
modellart: LoD3
comment: 'Fenster 3D' ist eine seitliche Begrenzungsfläche eines 'Bauteil 3D'.
subclass of: Oeffnung3D

AX Festpunkt
type: Class
grunddatenbestand: DFGM
kennung: 19006
modellart: DFGM
comment: Abstrakte Oberklasse aller Festpunkte
subclass of: AA ZUSO
subclass of: Restriction
  cardinality: 1
  on property: punktkennung
subclass of: Restriction
  cardinality: 1
  on property: gemeinde
subclass of: Restriction
  max cardinality: 1
  on property: gemarkung
subclass of: Restriction
  max cardinality: 1
  on property: katasteramt
subclass of: Restriction
  cardinality: 1
  on property: land
subclass of: Restriction
  max cardinality: 1
  on property: relativeHoehe
subclass of: Restriction
  max cardinality: 1
  on property: darstellungshinweis
subclass of: Restriction
  max cardinality: 1
  on property: nameLagebeschreibung
subclass of: Restriction
  all values from: ax-marke
  cardinality: 1
  on property: punktvermarkung
subclass of: Restriction
  max cardinality: 1
  on property: erstvermarkung
subclass of: Restriction
  max cardinality: 1
  on property: untergangsdatum
subclass of: Restriction
  max cardinality: 1
  on property: vermarkungsdatum
subclass of: Restriction
  cardinality: 1
  on property: nutzungExtern

Firstlinie
type: Class
kennung: 31004
modellart: DLKM
comment: 'Firstlinie' kennzeichnet den Verlauf des Dachfirstes eines Gebäudes, Turms oder Bauwerks.
subclass of: AG Linienobjekt

AX Flaeche3D
type: Class
grunddatenbestand: DHM
kennung: 62040
modellart: Basis-DLM
modellart: DHM
modellart: DLM50
comment: 'Fläche 3D’ ist eine Begrenzungsfläche eines dreidimensionalen Körpers. Sie kann sowohl flach als auch gekrümmt sein.
subclass of: AU MehrfachFlaechenObjekt 3D
subclass of: Restriction
  all values from: ax-art-flaeche3d
  cardinality: 1
  on property: art
subclass of: Restriction
  all values from: ax-ursprung
  max cardinality: 1
  on property: ursprung
subclass of: Restriction
  max cardinality: 1
  on property: qualitaetsangaben

Fläche besonderer funktionaler Prägung
type: Class
grunddatenbestand: Basis-DLM
grunddatenbestand: DLKM
grunddatenbestand: DLM50
kennung: 41007
modellart: Basis-DLM
modellart: DLKM
modellart: DLM250
modellart: DLM50
comment: 'Fläche besonderer funktionaler Prägung' ist eine baulich geprägte Fläche einschließlich der mit ihr im Zusammenhang stehenden Freifläche, auf denen vorwiegend Gebäude und/oder Anlagen zur Erfüllung öffentlicher Zwecke oder historische Anlagen vorhanden sind.
subclass of: AX TatsaechlicheNutzung
subclass of: Restriction
  all values from: ax-funktion-flaechebesondererfunktionalerpraegung
  max cardinality: 1
  on property: funktion
subclass of: Restriction
  all values from: ax-artderbebauung-flaechebesondererfunktionalerpraegung
  max cardinality: 1
  on property: artDerBebauung
subclass of: Restriction
  max cardinality: 1
  on property: name
subclass of: Restriction
  all values from: ax-zustand-flaechebesondererfunktionalerpraegung
  max cardinality: 1
  on property: zustand

Fläche gemischter Nutzung
type: Class
grunddatenbestand: Basis-DLM
grunddatenbestand: DLKM
kennung: 41006
modellart: Basis-DLM
modellart: DLKM
comment: 'Fläche gemischter Nutzung' ist eine bebaute Fläche einschließlich der mit ihr im Zusammenhang stehenden Freifläche (Hofraumfläche, Hausgarten), auf der keine Art der baulichen Nutzung vorherrscht. Solche Flächen sind insbesondere ländlich-dörflich geprägte Flächen mit land- und forstwirtschaftlichen Betrieben, Wohngebäuden u.a. sowie städtisch geprägte Kerngebiete mit Handelsbetrieben und zentralen Einrichtungen für die Wirtschaft und die Verwaltung.
subclass of: AX TatsaechlicheNutzung
subclass of: Restriction
  all values from: ax-artderbebauung-flaechegemischternutzung
  max cardinality: 1
  on property: artDerBebauung
subclass of: Restriction
  all values from: ax-funktion-flaechegemischternutzung
  max cardinality: 1
  on property: funktion
subclass of: Restriction
  max cardinality: 1
  on property: name
subclass of: Restriction
  all values from: ax-zustand-flaechegemischternutzung
  max cardinality: 1
  on property: zustand

Fließgewässer
type: Class
grunddatenbestand: Basis-DLM
grunddatenbestand: DLKM
grunddatenbestand: DLM50
kennung: 44001
modellart: Basis-DLM
modellart: DLKM
modellart: DLM1000
modellart: DLM250
modellart: DLM50
comment: 'Fließgewässer' ist ein geometrisch begrenztes, auf dem Festland fließendes Gewässer, das die Wassermengen sammelt, die als Niederschläge auf die Erdoberfläche fallen oder in Quellen austreten, und in ein anderes Gewässer, ein Meer oder in einen See transportiert oder ein in einem System von natürlichen oder künstlichen Bodenvertiefungen verlaufendes Wasser, das zur Be- und Entwässerung an- oder abgeleitet wird oder ein geometrisch begrenzter, für die Schifffahrt angelegter künstlicher Wasserlauf, der in einem oder in mehreren Abschnitten die jeweils gleiche Höhe des Wasserspiegels besitzt.
subclass of: AX TatsaechlicheNutzung
subclass of: Restriction
  all values from: ax-funktion-fliessgewaesser
  max cardinality: 1
  on property: funktion
subclass of: Restriction
  max cardinality: 1
  on property: name
subclass of: Restriction
  all values from: ax-zustand-kanal
  max cardinality: 1
  on property: zustand
subclass of: Restriction
  all values from: ax-hydrologischesmerkmal-fliessgewaesser
  max cardinality: 1
  on property: hydrologischesMerkmal

Flugverkehr
type: Class
grunddatenbestand: Basis-DLM
grunddatenbestand: DLKM
grunddatenbestand: DLM50
kennung: 42015
modellart: Basis-DLM
modellart: DLKM
modellart: DLM1000
modellart: DLM250
modellart: DLM50
comment: 'Flugverkehr' umfasst die baulich geprägte Fläche und die mit ihr in Zusammenhang stehende Freifläche, die ausschließlich oder vorwiegend dem Flugverkehr dient.
subclass of: AX TatsaechlicheNutzung
subclass of: Restriction
  all values from: ax-funktion-flugverkehr
  max cardinality: 1
  on property: funktion
subclass of: Restriction
  all values from: ax-art-flugverkehr
  max cardinality: 1
  on property: art
subclass of: Restriction
  max cardinality: 1
  on property: name
subclass of: Restriction
  max cardinality: 1
  on property: bezeichnung
subclass of: Restriction
  all values from: ax-nutzung-flugverkehr
  max cardinality: 1
  on property: nutzung
subclass of: Restriction
  all values from: ax-zustand-flugverkehr
  max cardinality: 1
  on property: zustand

Flugverkehrsanlage
type: Class
grunddatenbestand: Basis-DLM
grunddatenbestand: DLM50
kennung: 53007
modellart: Basis-DLM
modellart: DLKM
modellart: DLM1000
modellart: DLM250
modellart: DLM50
comment: 'Flugverkehrsanlage' ist eine Fläche, auf der Luftfahrzeuge bewegt oder abgestellt werden.
subclass of: AU Objekt
subclass of: Restriction
  all values from: ax-ergebnisderueberpruefung-bauwerkeeinrichtungenundsonstigeangaben
  max cardinality: 1
  on property: ergebnisDerUeberpruefung
subclass of: Restriction
  max cardinality: 1
  on property: qualitaetsangaben
subclass of: Restriction
  all values from: ax-art-flugverkehrsanlage
  cardinality: 1
  on property: art
subclass of: Restriction
  all values from: ax-oberflaechenmaterial-flugverkehrsanlage
  max cardinality: 1
  on property: oberflaechenmaterial
subclass of: Restriction
  max cardinality: 1
  on property: name
subclass of: Restriction
  max cardinality: 1
  on property: breiteDesObjekts
subclass of: Restriction
  max cardinality: 1
  on property: bezeichnung
subclass of: Restriction
  all values from: ax-zustand-flugverkehrsanlage
  max cardinality: 1
  on property: zustand

Flurstück
type: Class
grunddatenbestand: DLKM
kennung: 11001
modellart: DLKM
comment: 'Flurstück' ist ein Teil der Erdoberfläche, der von einer im Liegenschaftskataster festgelegten Grenzlinie umschlossen und mit einer Nummer bezeichnet ist. Es ist die Buchungseinheit des Liegenschaftskatasters.
subclass of: TA MultiSurfaceComponent
subclass of: Restriction
  cardinality: 1
  on property: gemarkung
subclass of: Restriction
  cardinality: 1
  on property: flurstuecksnummer
subclass of: Restriction
  cardinality: 1
  on property: flurstueckskennzeichen
subclass of: Restriction
  cardinality: 1
  on property: amtlicheFlaeche
subclass of: Restriction
  max cardinality: 1
  on property: flurnummer
subclass of: Restriction
  max cardinality: 1
  on property: flurstuecksfolge
subclass of: Restriction
  max cardinality: 1
  on property: abweichenderRechtszustand
subclass of: Restriction
  max cardinality: 1
  on property: zweifelhafterFlurstuecksnachweis
subclass of: Restriction
  max cardinality: 1
  on property: rechtsbehelfsverfahren
subclass of: Restriction
  max cardinality: 1
  on property: objektkoordinaten
subclass of: Restriction
  max cardinality: 1
  on property: zeitpunktDerEntstehung
subclass of: Restriction
  cardinality: 1
  on property: gemeindezugehoerigkeit
subclass of: Restriction
  cardinality: 1
  on property: istGebucht

AX FlurstueckGrundbuch
type: Class
grunddatenbestand: DLKM
kennung: 111001
modellart: DLKM
subclass of: AA NREO
subclass of: Restriction
  cardinality: 1
  on property: lebenszeitintervallFlurstueck
subclass of: Restriction
  max cardinality: 1
  on property: anlassFlurstueck
subclass of: Restriction
  cardinality: 1
  on property: amtlicheFlaeche
subclass of: Restriction
  max cardinality: 1
  on property: flurnummer
subclass of: Restriction
  max cardinality: 1
  on property: flurstuecksfolge
subclass of: Restriction
  cardinality: 1
  on property: flurstueckskennzeichen
subclass of: Restriction
  cardinality: 1
  on property: flurstuecksnummer
subclass of: Restriction
  cardinality: 1
  on property: gemarkung
subclass of: Restriction
  cardinality: 1
  on property: gemeindezugehoerigkeit
subclass of: Restriction
  max cardinality: 1
  on property: rechtsbehelfsverfahren
subclass of: Restriction
  max cardinality: 1
  on property: strittigeGrenze
subclass of: Restriction
  all values from: ax-wirtschaftsartgrundbuch
  min cardinality: 1
  on property: wirtschaftsart
subclass of: Restriction
  min cardinality: 1
  on property: lagebezeichnung
subclass of: Restriction
  cardinality: 1
  on property: zustaendigeStelle
subclass of: Restriction
  cardinality: 1
  on property: istGebucht
subclass of: Restriction
  cardinality: 1
  on property: istEinVerweisAufFlurstueck

AX_Flurstücksnummer
type: Class
grunddatenbestand: DLKM
kennung: 11005
modellart: DLKM
comment: 'AX_Flurstücksnummer' ist ein Datentyp, der alle Eigenschaften für den Aufbau der Attributart 'Flurstücksnummer' enthält.
subclass of: AbstractObject

Forstrecht
type: Class
kennung: 71010
modellart: DLKM
comment: 'Forstrecht' ist die auf den Grund und Boden bezogene Beschränkung, Belastung oder andere Eigenschaft einer Fläche nach öffentlichen, forstrechtlichen Vorschriften.
subclass of: AU Flaechenobjekt
subclass of: Restriction
  all values from: ax-artderfestlegung-forstrecht
  cardinality: 1
  on property: artDerFestlegung
subclass of: Restriction
  all values from: ax-besonderefunktion-forstrecht
  max cardinality: 1
  on property: besondereFunktion
subclass of: Restriction
  max cardinality: 1
  on property: ausfuehrendeStelle
subclass of: Restriction
  max cardinality: 1
  on property: bezeichnung
subclass of: Restriction
  max cardinality: 1
  on property: qualitaetsangaben

Fortführungsfall
type: Class
kennung: 15002
modellart: DLKM
comment: 'Fortführungsfall' beschreibt die notwendigen Angaben zum Aufbau eines Fortführungsnachweises. Er legt die Reihenfolge der zu verändernden Flurstücke innerhalb eines Fortführungsnachweises fest (Aufbau des Fortführungsnachweises).
subclass of: AA NREO
subclass of: Restriction
  cardinality: 1
  on property: fortfuehrungsfallnummer
subclass of: Restriction
  max cardinality: 1
  on property: laufendeNummer
subclass of: Restriction
  min cardinality: 1
  on property: ueberschriftImFortfuehrungsnachweis
subclass of: Restriction
  max cardinality: 1
  on property: anzahlDerFortfuehrungsmitteilungen
subclass of: Restriction
  max cardinality: 1
  on property: fortfuehrungsmitteilungAnEigentuemerAntragsteller
subclass of: Restriction
  max cardinality: 1
  on property: anmerkungFuerDenNotar
subclass of: Restriction
  max cardinality: 1
  on property: bemerkung
subclass of: Restriction
  max cardinality: 1
  on property: verweistAuf
subclass of: Restriction
  max cardinality: 1
  on property: inversZu beziehtSichAuf

Fortführungsfall Grundbuch
type: Class
grunddatenbestand: DLKM
kennung: 111003
modellart: DLKM
comment: 'Fortführungsfall Grundbuch' beschreibt die notwendigen Angaben zur automatisierten Mitteilung an die Grundbuchverwaltung. Er legt die Reihenfolge der zu verändernden Flurstücke innerhalb eines Fortführungsnachweises fest (Aufbau des Fortführungsnachweises). 'Fortführungsfall Grundbuch' wird gebildet für alle Objekte der Objektart AX_Fortfuehrungsfall. Die Attribute des Objekts AX_FortfuehrungsfallGrundbuch sind Kopien der Attribute von AX_FortfuehrungsnachweisDeckblatt und AX_Fortfuehrungsfall.
subclass of: AA NREO
subclass of: Restriction
  cardinality: 1
  on property: fortfuehrungsfallnummer
subclass of: Restriction
  max cardinality: 1
  on property: laufendeNummer
subclass of: Restriction
  min cardinality: 1
  on property: ueberschriftImFortfuehrungsnachweis
subclass of: Restriction
  max cardinality: 1
  on property: bezeichnungBauRaumOderBodenordnungsrecht
subclass of: Restriction
  max cardinality: 1
  on property: bemerkung

Fortführungsnachweis-Deckblatt
type: Class
kennung: 15001
modellart: DLKM
comment: 'Fortführungsnachweis-Deckblatt' enthält alle administrativen Angaben für einen Fortführungsnachweis.
subclass of: AA NREO
subclass of: Restriction
  max cardinality: 1
  on property: ausgabekopf
subclass of: Restriction
  max cardinality: 1
  on property: fortfuehrungsfallNummernbereich
subclass of: Restriction
  cardinality: 1
  on property: fNNummer
subclass of: Restriction
  cardinality: 1
  on property: titel
subclass of: Restriction
  cardinality: 1
  on property: inGemarkung
subclass of: Restriction
  max cardinality: 1
  on property: erstelltAm
subclass of: Restriction
  max cardinality: 1
  on property: eignungspruefungAm
subclass of: Restriction
  max cardinality: 1
  on property: fortfuehrungsentscheidungAm
subclass of: Restriction
  max cardinality: 1
  on property: fortfuehrungsentscheidungVon
subclass of: Restriction
  max cardinality: 1
  on property: eignungspruefungVon
subclass of: Restriction
  max cardinality: 1
  on property: fortfuehrungsmitteilungenErzeugt
subclass of: Restriction
  max cardinality: 1
  on property: bemerkung
subclass of: Restriction
  max cardinality: 1
  on property: verwaltungsaktJN
subclass of: Restriction
  max cardinality: 1
  on property: erstelltVon
subclass of: Restriction
  max cardinality: 1
  on property: bekanntgabeAnBeteiligteAm
subclass of: Restriction
  max cardinality: 1
  on property: grundbuchmitteilungFuerFinanzamt
subclass of: Restriction
  min cardinality: 1
  on property: beziehtSichAuf

AX_Fortführungsnummer
type: Class
kennung: 15004
modellart: DLKM
comment: 'AX_Fortführungsnummer' enthält die Bestandteile zur Ableitung der Nummer des Fortführungsnachweises.
subclass of: AbstractObject

Friedhof
type: Class
grunddatenbestand: Basis-DLM
grunddatenbestand: DLKM
grunddatenbestand: DLM50
kennung: 41009
modellart: Basis-DLM
modellart: DLKM
modellart: DLM250
modellart: DLM50
comment: 'Friedhof' ist eine Landfläche, die zur Bestattung dient oder gedient hat, sofern die Zuordnung zu Grünanlage nicht zutreffender ist. Waldbestattungsflächen werden der Nutzungsart Wald zugeordnet.
subclass of: AX TatsaechlicheNutzung
subclass of: Restriction
  all values from: ax-funktion-friedhof
  max cardinality: 1
  on property: funktion
subclass of: Restriction
  max cardinality: 1
  on property: name
subclass of: Restriction
  all values from: ax-zustand-friedhof
  max cardinality: 1
  on property: zustand

Gebäude
type: Class
grunddatenbestand: DLKM
kennung: 31001
modellart: Basis-DLM
modellart: DLKM
modellart: DLM1000
modellart: DLM250
modellart: DLM50
comment: 'Gebäude' ist ein dauerhaft errichtetes Bauwerk, dessen Nachweis wegen seiner Bedeutung als Liegenschaft erforderlich ist sowie dem Zweck der Basisinformation des Liegenschaftskatasters dient.
subclass of: AG Objekt
subclass of: Restriction
  all values from: ax-gebaeudefunktion
  cardinality: 1
  on property: gebaeudefunktion
subclass of: Restriction
  all values from: ax-bauweise-gebaeude
  max cardinality: 1
  on property: bauweise
subclass of: Restriction
  max cardinality: 1
  on property: anzahlDerOberirdischenGeschosse
subclass of: Restriction
  max cardinality: 1
  on property: anzahlDerUnterirdischenGeschosse
subclass of: Restriction
  max cardinality: 1
  on property: hochhaus
subclass of: Restriction
  all values from: ax-dachform
  max cardinality: 1
  on property: dachform
subclass of: Restriction
  all values from: ax-zustand-gebaeude
  max cardinality: 1
  on property: zustand
subclass of: Restriction
  max cardinality: 1
  on property: geschossflaeche
subclass of: Restriction
  max cardinality: 1
  on property: grundflaeche
subclass of: Restriction
  max cardinality: 1
  on property: umbauterRaum
subclass of: Restriction
  all values from: ax-lagezurerdoberflaeche-gebaeude
  max cardinality: 1
  on property: lageZurErdoberflaeche
subclass of: Restriction
  max cardinality: 1
  on property: dachart
subclass of: Restriction
  all values from: ax-dachgeschossausbau-gebaeude
  max cardinality: 1
  on property: dachgeschossausbau
subclass of: Restriction
  max cardinality: 1
  on property: gebaeudekennzeichen
subclass of: Restriction
  max cardinality: 1
  on property: qualitaetsangaben
subclass of: Restriction
  max cardinality: 1
  on property: hat
subclass of: Restriction
  max cardinality: 1
  on property: haengtZusammenMit
subclass of: Restriction
  max cardinality: 2
  on property: regionalsprache
subclass of: Restriction
  max cardinality: 1
  on property: zeigtAufOhne

AX GebaeudeInstallation3D
type: Class
kennung: 101011
modellart: LoD2
modellart: LoD3
comment: Eine 'Gebäudeinstallation 3D' ist ein außerhalb am Gebäude angebrachte Installation mit einer maßgeblichen räumlichen Ausdehnung.
subclass of: AU GeometrieObjekt 3D
subclass of: Restriction
  all values from: ax-funktion-gebaeudeinstallation3d
  cardinality: 1
  on property: funktion

Gebäudeausgestaltung
type: Class
kennung: 91001
modellart: DLKM
comment: 'Gebäudeausgestaltung' dient zur Speicherung von Gebäudeausgestaltungslinien, wenn eine Objektbildung im Zuge der Migration nicht möglich ist.
subclass of: AU Linienobjekt
subclass of: Restriction
  cardinality: 1
  on property: zeigtAuf
subclass of: Restriction
  all values from: ax-darstellung-gebaeudeausgestaltung
  cardinality: 1
  on property: darstellung

Gebiet
type: Class
grunddatenbestand: Basis-DLM
grunddatenbestand: DLM50
kennung: 75010
modellart: Basis-DLM
modellart: DLKM
modellart: DLM1000
modellart: DLM250
modellart: DLM50
comment: 'Gebiet' ist ein Teil der Erdoberfläche, der von einer festgelegten Grenzlinie umschlossen ist und den politischen Einflussbereich einer Verwaltungseinheit repräsentiert.
subclass of: TA MultiSurfaceComponent
subclass of: Restriction
  cardinality: 1
  on property: schluesselGesamt

Bundesland
type: Class
kennung: 75005
modellart: Basis-DLM
modellart: DLM1000
modellart: DLM250
modellart: DLM50
comment: 'Bundesland' umfasst das Gebiet des jeweiligen Bundeslandes innerhalb der Bundesrepublik Deutschland.
subclass of: Gebiet
subclass of: Restriction
  cardinality: 1
  on property: land

Kreis/Region
type: Class
kennung: 75007
modellart: Basis-DLM
modellart: DLKM
modellart: DLM1000
modellart: DLM250
modellart: DLM50
comment: 'Kreis/Region' enthält alle zur Kreisebene zählenden Verwaltungseinheiten innerhalb eines Bundeslandes.
subclass of: Gebiet
subclass of: Restriction
  cardinality: 1
  on property: kreis

Gebiet_Nationalstaat
type: Class
kennung: 75004
modellart: DLM1000
modellart: DLM250
comment: 'Gebiet_Nationalstaat' umfasst das Gebiet der Bundesrepublik Deutschland. Im Bereich der Nord- und Ostsee wird die Fläche durch die seewärtige Begrenzung der 12-Seemeilenzone definiert.
subclass of: Gebiet
subclass of: Restriction
  cardinality: 1
  on property: nationalstaat

Regierungsbezirk
type: Class
kennung: 75006
modellart: Basis-DLM
modellart: DLKM
modellart: DLM1000
modellart: DLM250
modellart: DLM50
comment: 'Regierungsbezirk' enthält alle zur Regierungsbezirksebene zählenden Verwaltungseinheiten innerhalb eines Bundeslandes.
subclass of: Gebiet
subclass of: Restriction
  cardinality: 1
  on property: regierungsbezirk

Verwaltungsgemeinschaft
type: Class
kennung: 75011
modellart: Basis-DLM
modellart: DLKM
modellart: DLM250
modellart: DLM50
comment: 'Verwaltungsgemeinschaft' umfasst das Gebiet der zur Verwaltungsgemeinschaft gehörenden Verwaltungseinheiten.
subclass of: Gebiet
subclass of: Restriction
  cardinality: 1
  on property: verwaltungsgemeinschaft
subclass of: Restriction
  all values from: ax-art-verbandsgemeinde
  max cardinality: 1
  on property: artDerVerbandsgemeinde

Gebietsgrenze
type: Class
grunddatenbestand: Basis-DLM
grunddatenbestand: DLM50
kennung: 75009
modellart: Basis-DLM
modellart: DLM1000
modellart: DLM250
modellart: DLM50
comment: 'Gebietsgrenze' ist ein Teil der Grenzlinie eines Gebiets.
subclass of: TA CurveComponent
subclass of: Restriction
  all values from: ax-artdergebietsgrenze-gebietsgrenze
  min cardinality: 1
  on property: artDerGebietsgrenze
subclass of: Restriction
  all values from: ax-zustand-gebietsgrenze
  max cardinality: 1
  on property: zustand

Gehölz
type: Class
grunddatenbestand: Basis-DLM
grunddatenbestand: DLKM
grunddatenbestand: DLM50
kennung: 43003
modellart: Basis-DLM
modellart: DLKM
modellart: DLM50
comment: 'Gehölz' ist eine Fläche, die mit einzelnen Bäumen, Baumgruppen, Büschen, Hecken und Sträuchern bestockt ist.
subclass of: AX TatsaechlicheNutzung
subclass of: Restriction
  all values from: ax-vegetationsmerkmal-gehoelz
  max cardinality: 1
  on property: vegetationsmerkmal
subclass of: Restriction
  max cardinality: 1
  on property: name
subclass of: Restriction
  all values from: ax-funktion-gehoelz
  max cardinality: 1
  on property: funktion

Gemarkung
type: Class
grunddatenbestand: DLKM
kennung: 73007
modellart: DFGM
modellart: DLKM
comment: 'Gemarkung' ist ein Katasterbezirk, der eine zusammenhängende Gruppe von Flurstücken umfasst. Er kann von Gemarkungsteilen/Fluren unterteilt werden.
subclass of: AA NREO
subclass of: Restriction
  cardinality: 1
  on property: schluesselGesamt
subclass of: Restriction
  cardinality: 1
  on property: bezeichnung
subclass of: Restriction
  max cardinality: 1
  on property: einwohnerzahl
subclass of: Restriction
  max cardinality: 1
  on property: historisch
subclass of: Restriction
  max cardinality: 2
  on property: regionalsprache
subclass of: Restriction
  cardinality: 1
  on property: schluessel

AX Gemarkung Schluessel
type: Class
grunddatenbestand: DLKM
kennung: 73019
modellart: DFGM
modellart: DLKM
comment: Amtliche Verschlüsselung der Gemarkung.
subclass of: AbstractObject

Gemarkungsteil/Flur
type: Class
grunddatenbestand: DLKM
kennung: 73008
modellart: DFGM
modellart: DLKM
comment: 'Gemarkungsteil/Flur' enthält die Gemarkungsteile und Fluren. Gemarkungsteile kommen nur in Bayern vor und entsprechen den Fluren in anderen Bundesländern.
subclass of: AA NREO
subclass of: Restriction
  cardinality: 1
  on property: schluesselGesamt
subclass of: Restriction
  cardinality: 1
  on property: bezeichnung
subclass of: Restriction
  max cardinality: 1
  on property: einwohnerzahl
subclass of: Restriction
  max cardinality: 1
  on property: historisch
subclass of: Restriction
  max cardinality: 2
  on property: regionalsprache
subclass of: Restriction
  cardinality: 1
  on property: schluessel

AX GemarkungsteilFlur Schluessel
type: Class
grunddatenbestand: DLKM
kennung: 73020
modellart: DFGM
modellart: DLKM
comment: Amtliche Verschlüsselung des Gemarkungsteils bzw. der Flur.
subclass of: AbstractObject

Gemeinde
type: Class
grunddatenbestand: Basis-DLM
grunddatenbestand: DLKM
grunddatenbestand: DLM50
kennung: 73005
modellart: Basis-DLM
modellart: DFGM
modellart: DLKM
modellart: DLM250
modellart: DLM50
comment: 'Gemeinde' enthält alle zur Gemeindeebene zählenden Verwaltungseinheiten innerhalb eines Bundeslandes.
subclass of: AA NREO
subclass of: Restriction
  cardinality: 1
  on property: schluesselGesamt
subclass of: Restriction
  cardinality: 1
  on property: bezeichnung
subclass of: Restriction
  max cardinality: 1
  on property: einwohnerzahl
subclass of: Restriction
  max cardinality: 1
  on property: historisch
subclass of: Restriction
  max cardinality: 2
  on property: regionalsprache
subclass of: Restriction
  cardinality: 1
  on property: gemeindekennzeichen

Gemeindekennzeichen
type: Class
grunddatenbestand: Basis-DLM
grunddatenbestand: DFGM
grunddatenbestand: DLKM
grunddatenbestand: DLM50
kennung: 73014
modellart: Basis-DLM
modellart: DFGM
modellart: DLKM
modellart: DLM250
modellart: DLM50
comment: 'Gemeindekennzeichen' ist die vom Statistischen Bundesamt veröffentlichte Schlüsselnummer des kommunalen Gebietes (Stadt-, Landgemeinde, gemeindefreies Gebiet). Das Gemeindekennzeichen (siehe Katalog der Gemeinden) besteht aus den Verschlüsselungen für : 1. Spalte: Land 2. Spalte: Regierungsbezirk 3. Spalte: Kreis (kreisfreie Stadt) 4. Spalte: Gemeinde und optional (siehe Katalog der Gemeindeteile) dem 5. Spalte: Gemeindeteil
subclass of: AbstractObject

Gemeindeteil
type: Class
kennung: 73006
modellart: Basis-DLM
modellart: DLKM
modellart: DLM50
comment: 'Gemeindeteil' enthält alle zur Gemeindeteilebene zählenden Verwaltungseinheiten innerhalb eines Bundeslandes.
subclass of: AA NREO
subclass of: Restriction
  cardinality: 1
  on property: schluesselGesamt
subclass of: Restriction
  cardinality: 1
  on property: bezeichnung
subclass of: Restriction
  max cardinality: 1
  on property: einwohnerzahl
subclass of: Restriction
  max cardinality: 1
  on property: historisch
subclass of: Restriction
  max cardinality: 2
  on property: regionalsprache
subclass of: Restriction
  cardinality: 1
  on property: gemeindekennzeichen

Georeferenzierte Gebäudeadresse
type: Class
kennung: 12006
modellart: DLKM
comment: 'Georeferenzierte Gebäudeadresse' enthält alle Informationen für die Ausgabe der amtlichen Hauskoordinate.
subclass of: AU Punktobjekt
subclass of: Restriction
  all values from: ax-qualitaet-hauskoordinate
  cardinality: 1
  on property: qualitaetsangaben
subclass of: Restriction
  cardinality: 1
  on property: land
subclass of: Restriction
  cardinality: 1
  on property: regierungsbezirk
subclass of: Restriction
  cardinality: 1
  on property: kreis
subclass of: Restriction
  cardinality: 1
  on property: gemeinde
subclass of: Restriction
  cardinality: 1
  on property: ortsteil
subclass of: Restriction
  cardinality: 1
  on property: strassenschluessel
subclass of: Restriction
  max cardinality: 1
  on property: hausnummer
subclass of: Restriction
  max cardinality: 1
  on property: adressierungszusatz
subclass of: Restriction
  max cardinality: 1
  on property: postalischeAdresse
subclass of: Restriction
  max cardinality: 1
  on property: weistAuf
subclass of: Restriction
  max cardinality: 1
  on property: verweistAuf
subclass of: Restriction
  max cardinality: 1
  on property: zeigtAuf

AX Gestaltung3D
type: Class
kennung: 103001
modellart: LoD1
modellart: LoD2
modellart: LoD3
comment: Vererbungsklasse für Angaben zum Material und zur Ausgestaltung.
subclass of: AA NREO
subclass of: Restriction
  max cardinality: 1
  on property: signaturnummer
subclass of: Restriction
  max cardinality: 1
  on property: darstellungsprioritaet
subclass of: Restriction
  max cardinality: 1
  on property: art
subclass of: Restriction
  max cardinality: 1
  on property: thema
subclass of: Restriction
  max cardinality: 1
  on property: vorderseite

Gewässerachse
type: Class
grunddatenbestand: Basis-DLM
grunddatenbestand: DLM50
kennung: 44004
modellart: Basis-DLM
modellart: DLKM
modellart: DLM1000
modellart: DLM250
modellart: DLM50
comment: 'Gewässerachse' repräsentiert eine Wasserfläche, die Bestandteil des topologischen Gewässernetzes ist.
subclass of: TA CurveComponent
subclass of: Restriction
  cardinality: 1
  on property: breiteDesGewaessers
subclass of: Restriction
  all values from: ax-hydrologischesmerkmal-gewaesserachse
  max cardinality: 1
  on property: hydrologischesMerkmal
subclass of: Restriction
  all values from: ax-funktion-gewaesserachse
  max cardinality: 1
  on property: funktion
subclass of: Restriction
  all values from: ax-zustand-gewaesserachse
  max cardinality: 1
  on property: zustand
subclass of: Restriction
  cardinality: 1
  on property: fliessrichtung

Gewässermerkmal
type: Class
grunddatenbestand: Basis-DLM
grunddatenbestand: DLM50
kennung: 55001
modellart: Basis-DLM
modellart: DLKM
modellart: DLM1000
modellart: DLM250
modellart: DLM50
comment: 'Gewässermerkmal' sind besondere Eigenschaften eines Gewässers.
subclass of: AU Objekt
subclass of: Restriction
  all values from: ax-ergebnisderueberpruefung-bauwerkeeinrichtungenundsonstigeangaben
  max cardinality: 1
  on property: ergebnisDerUeberpruefung
subclass of: Restriction
  max cardinality: 1
  on property: qualitaetsangaben
subclass of: Restriction
  all values from: ax-art-gewaessermerkmal
  cardinality: 1
  on property: art
subclass of: Restriction
  max cardinality: 1
  on property: name
subclass of: Restriction
  max cardinality: 1
  on property: bezeichnung
subclass of: Restriction
  max cardinality: 1
  on property: objekthoehe
subclass of: Restriction
  all values from: ax-hydrologischesmerkmal-gewaessermerkmal
  max cardinality: 1
  on property: hydrologischesMerkmal
subclass of: Restriction
  max cardinality: 2
  on property: regionalsprache

Gewässerstationierungsachse
type: Class
grunddatenbestand: Basis-DLM
kennung: 57003
modellart: Basis-DLM
modellart: DLKM
modellart: DLM1000
modellart: DLM250
modellart: DLM50
comment: 'Gewässerstationierungsachse' ist eine von einer Wasserfachstelle festgelegte Linie in Gewässern.
subclass of: TA CurveComponent
subclass of: Restriction
  all values from: ax-ergebnisderueberpruefung-bauwerkeeinrichtungenundsonstigeangaben
  max cardinality: 1
  on property: ergebnisDerUeberpruefung
subclass of: Restriction
  max cardinality: 1
  on property: qualitaetsangaben
subclass of: Restriction
  all values from: ax-artdergewaesserstationierungsachse
  max cardinality: 1
  on property: artDerGewaesserstationierungsachse
subclass of: Restriction
  max cardinality: 1
  on property: name
subclass of: Restriction
  max cardinality: 1
  on property: gewaesserkennzahl
subclass of: Restriction
  max cardinality: 1
  on property: identnummer
subclass of: Restriction
  cardinality: 1
  on property: fliessrichtung
subclass of: Restriction
  max cardinality: 2
  on property: regionalsprache
subclass of: Restriction
  all values from: ax-schifffahrtskategorie-gewaesserstationierungsachse
  max cardinality: 1
  on property: schifffahrtskategorie

Gewann
type: Class
kennung: 74003
modellart: Basis-DLM
comment: 'Gewann' ist ein bestimmtes, mit einem Namen bezeichnetes Gebiet der Erdoberfläche; Teil von 'Kleinräumiger Landschaftsteil'.
subclass of: AU Objekt
subclass of: Restriction
  cardinality: 1
  on property: name

Gleis
type: Class
kennung: 53006
modellart: Basis-DLM
modellart: DLKM
modellart: DLM50
comment: 'Gleis' ist ein zur Führung von Schienenfahrzeugen verlegtes Schienenpaar.
subclass of: AU Objekt
subclass of: Restriction
  all values from: ax-ergebnisderueberpruefung-bauwerkeeinrichtungenundsonstigeangaben
  max cardinality: 1
  on property: ergebnisDerUeberpruefung
subclass of: Restriction
  max cardinality: 1
  on property: qualitaetsangaben
subclass of: Restriction
  all values from: ax-art-gleis
  max cardinality: 1
  on property: art
subclass of: Restriction
  all values from: ax-lagezuroberflaeche-gleis
  max cardinality: 1
  on property: lageZurOberflaeche
subclass of: Restriction
  max cardinality: 1
  on property: name

Grabloch der Bodenschätzung
type: Class
grunddatenbestand: DLKM
kennung: 72003
modellart: DLKM
comment: 'Grabloch der Bodenschätzung' ist der Lagepunkt der Profilbeschreibung von Grablöchern.
subclass of: AU Punktobjekt
subclass of: Restriction
  all values from: ax-bedeutung-grablochderbodenschaetzung
  max cardinality: 2
  min cardinality: 1
  on property: bedeutung
subclass of: Restriction
  max cardinality: 1
  on property: inGemarkung
subclass of: Restriction
  cardinality: 1
  on property: kennziffer
subclass of: Restriction
  max cardinality: 1
  on property: bodenzahlOderGruenlandgrundzahlGrabloch
subclass of: Restriction
  max cardinality: 1
  on property: qualitaetsangaben
subclass of: Restriction
  max cardinality: 1
  on property: gehoertZu
subclass of: Restriction
  max cardinality: 1
  on property: bestimmt

Grenzpunkt
type: Class
grunddatenbestand: DLKM
kennung: 11003
modellart: DLKM
comment: 'Grenzpunkt' ist ein den Grenzverlauf bestimmender, meist durch Grenzzeichen gekennzeichneter Punkt.
subclass of: AA ZUSO
subclass of: Restriction
  max cardinality: 1
  on property: punktkennung
subclass of: Restriction
  max cardinality: 1
  on property: zustaendigeStelle
subclass of: Restriction
  all values from: ax-marke
  cardinality: 1
  on property: abmarkung Marke
subclass of: Restriction
  all values from: ax-bemerkungzurabmarkung-grenzpunkt
  max cardinality: 1
  on property: bemerkungZurAbmarkung
subclass of: Restriction
  max cardinality: 1
  on property: relativeHoehe
subclass of: Restriction
  max cardinality: 1
  on property: zwischenmarke
subclass of: Restriction
  max cardinality: 1
  on property: besonderePunktnummer
subclass of: Restriction
  max cardinality: 1
  on property: ausgesetzteAbmarkung
subclass of: Restriction
  max cardinality: 1
  on property: festgestellterGrenzpunkt
subclass of: Restriction
  all values from: ax-gruendederausgesetztenabmarkung-grenzpunkt
  max cardinality: 1
  on property: gruendeDerAusgesetztenAbmarkung
subclass of: Restriction
  all values from: ax-horizontfreiheit-grenzpunkt
  max cardinality: 1
  on property: horizontfreiheit
subclass of: Restriction
  max cardinality: 1
  on property: zeitpunktDerEntstehung
subclass of: Restriction
  max cardinality: 1
  on property: zeigtAuf

Grenzübergang
type: Class
grunddatenbestand: Basis-DLM
grunddatenbestand: DLM50
kennung: 52004
modellart: Basis-DLM
modellart: DLM1000
modellart: DLM250
modellart: DLM50
comment: 'Grenzübergang' ist eine amtlich zugelassene Grenzöffnung, die grundsätzlich zur Einreise nach und Ausreise aus Deutschland benutzt werden muss. Innerhalb der Staaten der Europäischen Union kann der Grenzübertritt an jeder beliebigen Stelle erfolgen.
subclass of: AU Objekt
subclass of: Restriction
  all values from: ax-ergebnisderueberpruefung-bauwerkeeinrichtungenundsonstigeangaben
  max cardinality: 1
  on property: ergebnisDerUeberpruefung
subclass of: Restriction
  max cardinality: 1
  on property: qualitaetsangaben
subclass of: Restriction
  max cardinality: 1
  on property: name

AX Hafen
type: Class
grunddatenbestand: Basis-DLM
grunddatenbestand: DLM50
kennung: 52002
modellart: Basis-DLM
modellart: DLKM
modellart: DLM250
modellart: DLM50
comment: Der ufernahe Bereich eines Gewässers, der so ausgebaut ist, dass Schiffe zum Be- und Entladen dort festmachen können und der gleichzeitig Schiffen Schutz bietet. Zum Hafen gehören neben den Wasserflächen der Hafenbecken auch die Flächen auf dem festen Land, die von den Be- und Entladeeinrichtungen, Lagergebäuden, Werften u.dgl. in Anspruch genommen werden.
subclass of: AU Objekt
subclass of: Restriction
  all values from: ax-ergebnisderueberpruefung-bauwerkeeinrichtungenundsonstigeangaben
  max cardinality: 1
  on property: ergebnisDerUeberpruefung
subclass of: Restriction
  max cardinality: 1
  on property: qualitaetsangaben
subclass of: Restriction
  all values from: ax-hafenkategorie-hafen
  max cardinality: 1
  on property: hafenkategorie
subclass of: Restriction
  max cardinality: 1
  on property: name
subclass of: Restriction
  all values from: ax-nutzung-hafen
  max cardinality: 1
  on property: nutzung

Hafenbecken
type: Class
grunddatenbestand: Basis-DLM
grunddatenbestand: DLKM
grunddatenbestand: DLM50
kennung: 44005
modellart: Basis-DLM
modellart: DLKM
modellart: DLM250
modellart: DLM50
comment: 'Hafenbecken' ist ein natürlicher oder künstlich angelegter oder abgetrennter Teil eines Gewässers, in dem Schiffe be- und entladen werden.
subclass of: AX TatsaechlicheNutzung
subclass of: Restriction
  all values from: ax-funktion-hafenbecken
  max cardinality: 1
  on property: funktion
subclass of: Restriction
  max cardinality: 1
  on property: name
subclass of: Restriction
  all values from: ax-nutzung-hafenbecken
  max cardinality: 1
  on property: nutzung
subclass of: Restriction
  max cardinality: 1
  on property: seekennzahl

Halde
type: Class
grunddatenbestand: Basis-DLM
grunddatenbestand: DLKM
grunddatenbestand: DLM50
kennung: 41003
modellart: Basis-DLM
modellart: DLKM
modellart: DLM250
modellart: DLM50
comment: 'Halde' ist eine Fläche, auf der Material langfristig gelagert wird und beschreibt die auch im Relief zu modellierende tatsächliche Aufschüttung. Dauerhaft anders genutzte Halden werden als Objekte entsprechend der tatsächlichen Nutzung erfasst.
subclass of: AX TatsaechlicheNutzung
subclass of: Restriction
  max cardinality: 1
  on property: name
subclass of: Restriction
  all values from: ax-lagergut-halde
  max cardinality: 1
  on property: lagergut
subclass of: Restriction
  all values from: ax-zustand-halde
  max cardinality: 1
  on property: zustand

Heide
type: Class
grunddatenbestand: Basis-DLM
grunddatenbestand: DLKM
grunddatenbestand: DLM50
kennung: 43004
modellart: Basis-DLM
modellart: DLKM
modellart: DLM1000
modellart: DLM250
modellart: DLM50
comment: 'Heide' ist eine Fläche mit typischen Sträuchern, Gräsern und geringwertigem Baumbestand.
subclass of: AX TatsaechlicheNutzung
subclass of: Restriction
  max cardinality: 1
  on property: name

Heilquelle, Gasquelle
type: Class
kennung: 51008
modellart: DLKM
comment: 'Heilquelle, Gasquelle' ist eine natürliche, örtlich begrenzte Austrittsstelle von Heilwasser oder Gas.
subclass of: AU Punktobjekt
subclass of: Restriction
  all values from: ax-ergebnisderueberpruefung-bauwerkeeinrichtungenundsonstigeangaben
  max cardinality: 1
  on property: ergebnisDerUeberpruefung
subclass of: Restriction
  max cardinality: 1
  on property: qualitaetsangaben
subclass of: Restriction
  all values from: ax-art-heilquellegasquelle
  cardinality: 1
  on property: art
subclass of: Restriction
  all values from: ax-hydrologischesmerkmal-heilquellegasquelle
  max cardinality: 1
  on property: hydrologischesMerkmal
subclass of: Restriction
  max cardinality: 1
  on property: name

Historisches Bauwerk oder historische Einrichtung
type: Class
grunddatenbestand: Basis-DLM
grunddatenbestand: DLM50
kennung: 51007
modellart: Basis-DLM
modellart: DLKM
modellart: DLM250
modellart: DLM50
comment: 'Historisches Bauwerk oder historische Einrichtung' ist ein Bauwerk oder eine Einrichtung von geschichtlicher Bedeutung.
subclass of: AG Objekt
subclass of: Restriction
  all values from: ax-ergebnisderueberpruefung-bauwerkeeinrichtungenundsonstigeangaben
  max cardinality: 1
  on property: ergebnisDerUeberpruefung
subclass of: Restriction
  max cardinality: 1
  on property: qualitaetsangaben
subclass of: Restriction
  all values from: ax-archaeologischertyp-historischesbauwerkoderhistorischeeinrichtung
  cardinality: 1
  on property: archaeologischerTyp
subclass of: Restriction
  max cardinality: 1
  on property: name

Historisches Flurstück
type: Class
kennung: 17001
modellart: DLKM
comment: 'Historisches Flurstück' ist ein fachlich nicht mehr aktuelles Flurstück, das im Rahmen der Historisierung in ALKIS entsteht (ALKIS-Standardhistorie). Das 'Historische Flurstück' mit seinen abgeleiteten Inhalten ist auch für führende Stellen, die die Vollhistorie führen, und für deren Nutzer von großem Mehrwert, da es: - die Informationsmenge so bündelt, wie es viele Anwender benötigen, - die Performance bei der Bereitstellung der Informationen erheblich steigert und somit - die Flexibilität der Nutzung wesentlich erhöht.
subclass of: AU Flaechenobjekt
subclass of: Restriction
  cardinality: 1
  on property: gemarkung
subclass of: Restriction
  cardinality: 1
  on property: flurstuecksnummer
subclass of: Restriction
  cardinality: 1
  on property: flurstueckskennzeichen
subclass of: Restriction
  cardinality: 1
  on property: amtlicheFlaeche
subclass of: Restriction
  max cardinality: 1
  on property: flurnummer
subclass of: Restriction
  max cardinality: 1
  on property: flurstuecksfolge
subclass of: Restriction
  max cardinality: 1
  on property: abweichenderRechtszustand
subclass of: Restriction
  max cardinality: 1
  on property: zweifelhafterFlurstuecksnachweis
subclass of: Restriction
  max cardinality: 1
  on property: rechtsbehelfsverfahren
subclass of: Restriction
  max cardinality: 1
  on property: objektkoordinaten
subclass of: Restriction
  max cardinality: 1
  on property: zeitpunktDerEntstehung
subclass of: Restriction
  cardinality: 1
  on property: gemeindezugehoerigkeit
subclass of: Restriction
  max cardinality: 1
  on property: zeitpunktDerHistorisierung

Historisches Flurstück ALB
type: Class
kennung: 17002
modellart: DLKM
comment: 'Historisches Flurstück ALB' ist ein nicht mehr aktuelles Flurstück, das schon im ALB historisch geworden ist und nach ALKIS migriert wird und in der ALKIS-Standardhistorie geführt wird.
subclass of: AA NREO
subclass of: Restriction
  cardinality: 1
  on property: gemarkung
subclass of: Restriction
  cardinality: 1
  on property: flurstuecksnummer
subclass of: Restriction
  cardinality: 1
  on property: flurstueckskennzeichen
subclass of: Restriction
  cardinality: 1
  on property: amtlicheFlaeche
subclass of: Restriction
  max cardinality: 1
  on property: flurnummer
subclass of: Restriction
  max cardinality: 1
  on property: flurstuecksfolge
subclass of: Restriction
  max cardinality: 1
  on property: objektkoordinaten
subclass of: Restriction
  max cardinality: 1
  on property: zeitpunktDerEntstehungDesBezugsflurstuecks
subclass of: Restriction
  max cardinality: 1
  on property: laufendeNummerDerFortfuehrung
subclass of: Restriction
  max cardinality: 1
  on property: fortfuehrungsart

Historisches Flurstück ohne Raumbezug
type: Class
kennung: 17003
modellart: DLKM
comment: 'Historisches Flurstück ohne Raumbezug' ist ein nicht mehr aktuelles Flurstück, das schon im ALB historisch geworden ist, nach ALKIS migriert und im Rahmen der Vollhistorie geführt wird.
subclass of: AA NREO
subclass of: Restriction
  cardinality: 1
  on property: gemarkung
subclass of: Restriction
  cardinality: 1
  on property: flurstuecksnummer
subclass of: Restriction
  cardinality: 1
  on property: flurstueckskennzeichen
subclass of: Restriction
  cardinality: 1
  on property: amtlicheFlaeche
subclass of: Restriction
  max cardinality: 1
  on property: flurnummer
subclass of: Restriction
  max cardinality: 1
  on property: flurstuecksfolge
subclass of: Restriction
  max cardinality: 1
  on property: abweichenderRechtszustand
subclass of: Restriction
  max cardinality: 1
  on property: zweifelhafterFlurstuecksnachweis
subclass of: Restriction
  max cardinality: 1
  on property: rechtsbehelfsverfahren
subclass of: Restriction
  max cardinality: 1
  on property: objektkoordinaten
subclass of: Restriction
  max cardinality: 1
  on property: zeitpunktDerEntstehung
subclass of: Restriction
  cardinality: 1
  on property: gemeindezugehoerigkeit
subclass of: Restriction
  max cardinality: 1
  on property: istHistGebucht

Höhenfestpunkt
type: Class
grunddatenbestand: DFGM
kennung: 19002
modellart: DFGM
comment: 'Höhenfestpunkt' (HFP) ist ein Festpunkt der Grundlagenvermessung für die Höhe.
subclass of: AX Festpunkt
subclass of: Restriction
  all values from: ax-ordnung-hoehenfestpunkt
  max cardinality: 1
  on property: ordnung
subclass of: Restriction
  max cardinality: 1
  on property: qualitaetsangaben
subclass of: Restriction
  max cardinality: 1
  on property: istIdentischMitLFP
subclass of: Restriction
  max cardinality: 1
  on property: unterschiedlicherBezugspunktMitLFP
subclass of: Restriction
  max cardinality: 1
  on property: istIdentischMitSFP
subclass of: Restriction
  max cardinality: 1
  on property: unterschiedlicherBezugspunktMitSFP
subclass of: Restriction
  max cardinality: 1
  on property: unterschiedlicherBezugspunktMitAP
subclass of: Restriction
  max cardinality: 1
  on property: unterschiedlicherBezugspunktMitSP
subclass of: Restriction
  max cardinality: 1
  on property: unterschiedlicherBezugspunktMitSVP
subclass of: Restriction
  max cardinality: 1
  on property: istIdentischMitRSP

Höhenlinie
type: Class
kennung: 61008
modellart: Basis-DLM
modellart: DLKM
modellart: DLM1000
modellart: DLM250
modellart: DLM50
comment: 'Höhenlinie' ist die Schnittlinie einer Objektfläche (z.B. des Geländes) mit einer Fläche konstanter Höhe über oder unter einer Höhenbezugsfläche.
subclass of: AU Linienobjekt
subclass of: Restriction
  cardinality: 1
  on property: hoeheVonHoehenlinie
subclass of: Restriction
  max cardinality: 1
  on property: qualitaetsangaben

Höhleneingang
type: Class
grunddatenbestand: Basis-DLM
grunddatenbestand: DLM50
kennung: 61005
modellart: Basis-DLM
modellart: DLKM
modellart: DLM250
modellart: DLM50
comment: 'Höhleneingang' ist die Öffnung eines unterirdischen Hohlraumes an der Erdoberfläche.
subclass of: AU Punktobjekt
subclass of: Restriction
  max cardinality: 1
  on property: name
subclass of: Restriction
  all values from: ax-zustand-hoehleneingang
  max cardinality: 1
  on property: zustand
subclass of: Restriction
  max cardinality: 1
  on property: qualitaetsangaben

Industrie- und Gewerbefläche
type: Class
grunddatenbestand: Basis-DLM
grunddatenbestand: DLKM
grunddatenbestand: DLM50
kennung: 41002
modellart: Basis-DLM
modellart: DLKM
modellart: DLM250
modellart: DLM50
comment: 'Industrie- und Gewerbefläche' ist eine Fläche, auf der sich Industrie-, Gewerbe-, Handels- und Dienstleistungsunternehmen sowie deren Betriebsflächen befinden.
subclass of: AX TatsaechlicheNutzung
subclass of: Restriction
  all values from: ax-funktion-industrieundgewerbeflaeche
  max cardinality: 1
  on property: funktion
subclass of: Restriction
  max cardinality: 1
  on property: name
subclass of: Restriction
  max cardinality: 1
  on property: bezeichnung
subclass of: Restriction
  all values from: ax-foerdergut-industrieundgewerbeflaeche
  max cardinality: 1
  on property: foerdergut
subclass of: Restriction
  all values from: ax-lagergut-industrieundgewerbeflaeche
  max cardinality: 1
  on property: lagergut
subclass of: Restriction
  all values from: ax-primaerenergie-industrieundgewerbeflaeche
  max cardinality: 1
  on property: primaerenergie
subclass of: Restriction
  all values from: ax-zustand-industrieundgewerbeflaeche
  max cardinality: 1
  on property: zustand

Insel
type: Class
grunddatenbestand: Basis-DLM
grunddatenbestand: DLM50
kennung: 74004
modellart: Basis-DLM
modellart: DLKM
modellart: DLM1000
modellart: DLM250
modellart: DLM50
comment: 'Insel' ist ein von Wasser umgebener Teil der Erdoberfläche.
subclass of: AU Objekt
subclass of: Restriction
  max cardinality: 1
  on property: name
subclass of: Restriction
  max cardinality: 2
  on property: regionalsprache

AX K ANSCHRIFT
type: Class
grunddatenbestand: DFGM
grunddatenbestand: DLKM
kennung: AAS
modellart: DFGM
modellart: DLKM
comment: Der komplexe Datentyp 'AX_K_Anschrift' enthält Angaben zu Straße, Hausnummer, Postleitzahl, Ort und Telefon. Hierzu werden die Bestandsdaten aus 'AX_Anschrift' der zugehörigen Dienststelle in Ausgabeinformationen gewandelt.
subclass of: AbstractObject

AX K AUSGKOPF Standard
type: Class
grunddatenbestand: DFGM
grunddatenbestand: DLKM
kennung: AKS
modellart: DFGM
modellart: DLKM
comment: Der komplexe Datentyp 'AX_K_AUSGKOPF_Standard' enthält Angaben, die in den Kopfzeilen von Standardausgaben benötigt werden. Für den Datentyp AX_K_AUSGKOPF_Standard werden die Objekte AX_Dienststelle, stellenart = 1100 (Katasteramt) einschließlich 'hat’ AX_Anschrift benötigt.
subclass of: AbstractObject

Kanal
type: Class
grunddatenbestand: Basis-DLM
grunddatenbestand: DLM50
kennung: 44003
modellart: Basis-DLM
modellart: DLKM
modellart: DLM1000
modellart: DLM250
modellart: DLM50
comment: 'Kanal' ist ein für die Schifffahrt angelegter künstlicher Wasserlauf.
subclass of: AA ZUSO
subclass of: Restriction
  max cardinality: 1
  on property: name
subclass of: Restriction
  all values from: ax-widmung-kanal
  max cardinality: 1
  on property: widmung
subclass of: Restriction
  max cardinality: 1
  on property: gewaesserkennzahl
subclass of: Restriction
  max cardinality: 1
  on property: identnummer
subclass of: Restriction
  all values from: ax-schifffahrtskategorie-kanal
  max cardinality: 1
  on property: schifffahrtskategorie
subclass of: Restriction
  max cardinality: 2
  on property: regionalsprache

AX_KennzifferGrabloch
type: Class
grunddatenbestand: DLKM
kennung: 72010
modellart: DLKM
comment: 'AX_KennzifferGrabloch' ist ein Datentyp, der alle Eigenschaften für den Aufbau der Attributart 'Kennziffer' enthält.
subclass of: AbstractObject

Klassifikation
type: Class
grunddatenbestand: DFGM
kennung: 19013
modellart: DFGM
comment: 'Klassifikation' gibt Ordnung, Hierarchiestufe und ggf. Wertigkeit des Festpunkts an.
subclass of: AbstractObject

Klassifizierung nach Straßenrecht
type: Class
kennung: 71001
modellart: DLKM
comment: 'Klassifizierung nach Straßenrecht' ist die auf den Grund und Boden bezogene Beschränkung, Belastung oder andere Eigenschaft einer Fläche nach öffentlichen, straßenrechtlichen Vorschriften.
subclass of: AU Objekt
subclass of: Restriction
  all values from: ax-artderfestlegung-klassifizierungnachstrassenrecht
  cardinality: 1
  on property: artDerFestlegung
subclass of: Restriction
  max cardinality: 1
  on property: bezeichnung
subclass of: Restriction
  max cardinality: 1
  on property: ausfuehrendeStelle
subclass of: Restriction
  max cardinality: 1
  on property: qualitaetsangaben

Klassifizierung nach Wasserrecht
type: Class
kennung: 71003
modellart: DLKM
comment: 'Klassifizierung nach Wasserrecht' ist die auf den Grund und Boden bezogene Beschränkung, Belastung oder andere Eigenschaft einer Fläche nach öffentlichen, wasserrechtlichen Vorschriften.
subclass of: AU Flaechenobjekt
subclass of: Restriction
  all values from: ax-artderfestlegung-klassifizierungnachwasserrecht
  cardinality: 1
  on property: artDerFestlegung
subclass of: Restriction
  max cardinality: 1
  on property: ausfuehrendeStelle
subclass of: Restriction
  max cardinality: 1
  on property: bezeichnung
subclass of: Restriction
  max cardinality: 1
  on property: qualitaetsangaben
subclass of: Restriction
  all values from: ax-ergebnisderueberpruefung-klassifizierungnachwasserrecht
  max cardinality: 1
  on property: ergebnisDerUeberpruefung

Kleinräumiger Landschaftsteil
type: Class
kennung: 74002
modellart: DLKM
comment: 'Kleinräumiger Landschaftsteil' ist ein kleinerer Teil der Erdoberfläche, der hinsichtlich des äußeren Erscheinungsbildes (Bodenformen, Bewuchs, Besiedlung, Bewirtschaftung) in bestimmter Weise geprägt ist.
subclass of: AU Objekt
subclass of: Restriction
  all values from: ax-landschaftstyp
  cardinality: 1
  on property: landschaftstyp
subclass of: Restriction
  cardinality: 1
  on property: name

Kommunales Gebiet
type: Class
grunddatenbestand: Basis-DLM
grunddatenbestand: DLM50
kennung: 75003
modellart: Basis-DLM
modellart: DLKM
modellart: DLM250
modellart: DLM50
comment: 'Kommunales Gebiet' ist ein Teil der Erdoberfläche, der von einer festgelegten Grenzlinie umschlossen ist und den politischen Einflussbereich einer Kommune repräsentiert (z.B. Stadt-, Landgemeinde, gemeindefreies Gebiet).
subclass of: Gebiet
subclass of: Restriction
  cardinality: 1
  on property: gemeindekennzeichen
subclass of: Restriction
  max cardinality: 1
  on property: gemeindeflaeche

Kommunales Teilgebiet
type: Class
kennung: 75012
modellart: Basis-DLM
modellart: DLKM
modellart: DLM50
comment: 'Kommunales Teilgebiet' ist ein Teil der Erdoberfläche, der von einer festgelegten Grenzlinie umschlossen ist und den politischen Einflussbereich eines Teils einer Kommune repräsentiert (z. B. Stadtbezirk, Stadtteil, Gemeindeteil, usw.).
subclass of: AG Flaechenobjekt
subclass of: Restriction
  cardinality: 1
  on property: hierarchiename
subclass of: Restriction
  cardinality: 1
  on property: hierarchiestufe
subclass of: Restriction
  cardinality: 1
  on property: kennzeichen
subclass of: Restriction
  cardinality: 1
  on property: schluesselGesamt
subclass of: Restriction
  cardinality: 1
  on property: bezeichnung
subclass of: Restriction
  max cardinality: 1
  on property: einwohnerzahl
subclass of: Restriction
  max cardinality: 1
  on property: historisch
subclass of: Restriction
  max cardinality: 2
  on property: regionalsprache

Kondominium
type: Class
grunddatenbestand: Basis-DLM
grunddatenbestand: DLM50
kennung: 75008
modellart: Basis-DLM
modellart: DLM1000
modellart: DLM250
modellart: DLM50
comment: 'Kondominium' ist im Völkerrecht ein Gebiet, das von mehreren Nationalstaaten gemeinsam verwaltet wird.
subclass of: AU Flaechenobjekt

Kreis/Region
type: Class
grunddatenbestand: Basis-DLM
grunddatenbestand: DLKM
grunddatenbestand: DLM50
kennung: 73004
modellart: Basis-DLM
modellart: DFGM
modellart: DLKM
modellart: DLM1000
modellart: DLM250
modellart: DLM50
comment: 'Kreis/Region' enthält alle zur Kreisebene zählenden Verwaltungseinheiten innerhalb eines Bundeslandes.
subclass of: AA NREO
subclass of: Restriction
  cardinality: 1
  on property: schluesselGesamt
subclass of: Restriction
  cardinality: 1
  on property: bezeichnung
subclass of: Restriction
  max cardinality: 1
  on property: einwohnerzahl
subclass of: Restriction
  max cardinality: 1
  on property: historisch
subclass of: Restriction
  max cardinality: 2
  on property: regionalsprache
subclass of: Restriction
  cardinality: 1
  on property: schluessel

AX Kreis Schluessel
type: Class
grunddatenbestand: Basis-DLM
grunddatenbestand: DLKM
grunddatenbestand: DLM50
kennung: 73022
modellart: Basis-DLM
modellart: DFGM
modellart: DLKM
modellart: DLM1000
modellart: DLM250
modellart: DLM50
comment: Amtliche Verschlüsselung des Kreises.
subclass of: AbstractObject

Lage
type: Class
grunddatenbestand: DLKM
kennung: 12005
modellart: Basis-DLM
modellart: DLKM
modellart: DLM1000
modellart: DLM250
modellart: DLM50
comment: 'Lage' ist eine Klasse mit Eigenschaften, die für alle Objektarten dieser Objektartengruppe gelten und an diese vererbt werden.
subclass of: AA NREO
subclass of: Restriction
  cardinality: 1
  on property: lagebezeichnung

AX Lagebezeichnung
type: Class
grunddatenbestand: Basis-DLM
grunddatenbestand: DLKM
grunddatenbestand: DLM1000
grunddatenbestand: DLM250
grunddatenbestand: DLM50
kennung: 12004
modellart: Basis-DLM
modellart: DLKM
modellart: DLM1000
modellart: DLM250
modellart: DLM50
comment: Der Auswahldatentyp 'Lagebezeichnung' beinhaltet eine verschlüsselte oder unverschlüsselte Lagebezeichnung.
subclass of: AbstractObject

Lagebezeichnung Katalogeintrag
type: Class
grunddatenbestand: DLKM
kennung: 73013
modellart: Basis-DLM
modellart: DLKM
modellart: DLM50
comment: 'Lagebezeichnung Katalogeintrag' enthält die eindeutige Verschlüsselung von Lagebezeichnungen und Straßen innerhalb einer Gemeinde mit der entsprechenden Bezeichnung.
subclass of: AA NREO
subclass of: Restriction
  cardinality: 1
  on property: schluesselGesamt
subclass of: Restriction
  cardinality: 1
  on property: bezeichnung
subclass of: Restriction
  max cardinality: 1
  on property: einwohnerzahl
subclass of: Restriction
  max cardinality: 1
  on property: historisch
subclass of: Restriction
  max cardinality: 2
  on property: regionalsprache
subclass of: Restriction
  cardinality: 1
  on property: schluessel
subclass of: Restriction
  max cardinality: 1
  on property: kennung

Lagebezeichnung mit Hausnummer
type: Class
grunddatenbestand: DLKM
kennung: 12002
modellart: Basis-DLM
modellart: DLKM
comment: 'Lagebezeichnung mit Hausnummer' ist die ortsübliche oder amtlich festgesetzte Benennung der Lage von Flurstücken und Gebäuden, die eine Lagebezeichnung mit Hausnummer haben. Hinweis zur Ableitung einer punktförmigen Geometrie zur Verortung der Hausnummer: Bei einer abweichenden Positionierung von der Standardposition liegt ein Präsentationsobjekt (Text) vor aus dem diese abgeleitet werden kann.
subclass of: Lage
subclass of: Restriction
  cardinality: 1
  on property: hausnummer
subclass of: Restriction
  max cardinality: 1
  on property: ortsteil
subclass of: Restriction
  max cardinality: 1
  on property: beziehtSichAuf
subclass of: Restriction
  max cardinality: 1
  on property: weistZum
subclass of: Restriction
  max cardinality: 1
  on property: beziehtSichAuchAuf

Lagebezeichnung mit Pseudonummer
type: Class
kennung: 12003
modellart: Basis-DLM
modellart: DLKM
comment: 'Lagebezeichnung mit Pseudonummer' ist die von der katasterführenden Stelle für ein bestehendes oder geplantes Gebäude vergebene Lagebezeichnung und ggf. einem Adressierungszusatz, wenn von der Gemeinde für das Gebäude keine Lagebezeichnung mit Hausnummer vergeben wurde (z. B. Kirche, Nebengebäude).
subclass of: Lage
subclass of: Restriction
  cardinality: 1
  on property: pseudonummer
subclass of: Restriction
  max cardinality: 1
  on property: laufendeNummer
subclass of: Restriction
  max cardinality: 1
  on property: ortsteil
subclass of: Restriction
  max cardinality: 1
  on property: gehoertZu
subclass of: Restriction
  max cardinality: 1
  on property: gehoertZuPseudo

Lagebezeichnung ohne Hausnummer
type: Class
grunddatenbestand: DLKM
kennung: 12001
modellart: DLKM
comment: 'Lagebezeichnung ohne Hausnummer' ist die ortsübliche oder amtlich festgesetzte Benennung der Lage von Flurstücken und Gebäuden, die keine Hausnummer haben (z.B. Namen und Bezeichnungen von Gewannen, Straßen, Gewässern).
subclass of: Lage
subclass of: Restriction
  max cardinality: 1
  on property: zusatzZurLagebezeichnung
subclass of: Restriction
  max cardinality: 1
  on property: ortsteil
subclass of: Restriction
  max cardinality: 1
  on property: gehoertAuchZu
subclass of: Restriction
  max cardinality: 1
  on property: gehoertZuOhne

Lagefestpunkt
type: Class
grunddatenbestand: DFGM
kennung: 19001
modellart: DFGM
comment: 'Lagefestpunkt' (LFP) ist ein Festpunkt der Grundlagenvermessung für die räumliche Position (3D) oder die Lage (2D).
subclass of: AX Festpunkt
subclass of: Restriction
  max cardinality: 1
  on property: pfeilerhoehe
subclass of: Restriction
  max cardinality: 1
  on property: klassifikation
subclass of: Restriction
  all values from: ax-funktion-lagefestpunkt
  max cardinality: 1
  on property: funktion
subclass of: Restriction
  max cardinality: 1
  on property: qualitaetsangaben
subclass of: Restriction
  max cardinality: 1
  on property: istIdentischMitHFP
subclass of: Restriction
  max cardinality: 1
  on property: istIdentischMitSFP
subclass of: Restriction
  max cardinality: 1
  on property: istIdentischMitRSP
subclass of: Restriction
  max cardinality: 1
  on property: unterschiedlicherBezugspunktMitHFP
subclass of: Restriction
  max cardinality: 1
  on property: unterschiedlicherBezugspunktMitSFP
subclass of: Restriction
  max cardinality: 1
  on property: istExzentrumZu
subclass of: Restriction
  max cardinality: 1
  on property: istIdentischMitAP
subclass of: Restriction
  max cardinality: 1
  on property: istIdentischMitSVP
subclass of: Restriction
  max cardinality: 1
  on property: istIdentischMitGrenzpunkt
subclass of: Restriction
  max cardinality: 1
  on property: unterschiedlicherBezugspunktMitSVP
subclass of: Restriction
  max cardinality: 1
  on property: unterschiedlicherBezugspunktMitAP
subclass of: Restriction
  max cardinality: 1
  on property: unterschiedlicherBezugspunktMitGrenzpunkt

AX Landeswappen
type: Class
grunddatenbestand: DLKM
kennung: LWP
modellart: DFGM
modellart: DLKM
comment: Die Externe Objektart "Landeswappen" enthält das Landeswappen als Pixelgraphik in einer externen Datei, z.B. im Format PNG.
subclass of: AbstractObject

Landschaft
type: Class
kennung: 74001
modellart: Basis-DLM
modellart: DLKM
modellart: DLM1000
modellart: DLM250
modellart: DLM50
comment: 'Landschaft' ist hinsichtlich des äußeren Erscheinungsbildes (Bodenformen, Bewuchs, Besiedlung, Bewirtschaftung) ein in bestimmter Weise geprägter Teil der Erdoberfläche.
subclass of: AU Objekt
subclass of: Restriction
  all values from: ax-landschaftstyp
  max cardinality: 1
  on property: landschaftstyp
subclass of: Restriction
  cardinality: 1
  on property: name
subclass of: Restriction
  max cardinality: 2
  on property: regionalsprache

Landwirtschaft
type: Class
grunddatenbestand: Basis-DLM
grunddatenbestand: DLKM
grunddatenbestand: DLM50
kennung: 43001
modellart: Basis-DLM
modellart: DLKM
modellart: DLM1000
modellart: DLM250
modellart: DLM50
comment: 'Landwirtschaft' ist eine Fläche für den Anbau von Feldfrüchten sowie eine Fläche, die beweidet und gemäht werden kann, einschließlich der mit besonderen Pflanzen angebauten Fläche (einschließlich landwirtschaftlichen Brachlands).
subclass of: AX TatsaechlicheNutzung
subclass of: Restriction
  all values from: ax-vegetationsmerkmal-landwirtschaft
  max cardinality: 1
  on property: vegetationsmerkmal
subclass of: Restriction
  max cardinality: 1
  on property: name

Leitung
type: Class
grunddatenbestand: Basis-DLM
grunddatenbestand: DLM50
kennung: 51005
modellart: Basis-DLM
modellart: DLKM
modellart: DLM250
modellart: DLM50
comment: 'Leitung' ist eine aus Drähten oder Fasern hergestellte Leitung zum Transport von elektrischer Energie und zur Übertragung von elektrischen Signalen.
subclass of: AU KontinuierlichesLinienobjekt
subclass of: Restriction
  all values from: ax-ergebnisderueberpruefung-bauwerkeeinrichtungenundsonstigeangaben
  max cardinality: 1
  on property: ergebnisDerUeberpruefung
subclass of: Restriction
  max cardinality: 1
  on property: qualitaetsangaben
subclass of: Restriction
  all values from: ax-bauwerksfunktion-leitung
  cardinality: 1
  on property: bauwerksfunktion
subclass of: Restriction
  max cardinality: 1
  on property: spannungsebene
subclass of: Restriction
  max cardinality: 1
  on property: name

Listenelement3D
type: Class
kennung: 101032
modellart: LoD1
modellart: LoD2
modellart: LoD3
comment: 'Listenelement3D' gibt den Wert der Höhe der Geschosse in Metern an. Falls die Höhe von einzelnen Geschossen nicht bekannt ist, muss für diese 'null' angegeben werden.
subclass of: AbstractObject

AX Material3D
type: Class
kennung: 103002
modellart: LoD1
modellart: LoD2
modellart: LoD3
comment: Darstellungsrelevante Materialeigenschaften
subclass of: AX Gestaltung3D
subclass of: Restriction
  cardinality: 1
  on property: materialeigenschaft
subclass of: Restriction
  max cardinality: 1
  on property: aktualitaet

AX Materialeigenschaft Material3D
type: Class
kennung: 103004
modellart: LoD1
modellart: LoD2
modellart: LoD3
subclass of: AbstractObject

Meer
type: Class
grunddatenbestand: Basis-DLM
grunddatenbestand: DLKM
grunddatenbestand: DLM50
kennung: 44007
modellart: Basis-DLM
modellart: DLKM
modellart: DLM1000
modellart: DLM250
modellart: DLM50
comment: 'Meer' ist die das Festland umgebende Wasserfläche.
subclass of: AX TatsaechlicheNutzung
subclass of: Restriction
  all values from: ax-funktion-meer
  max cardinality: 1
  on property: funktion
subclass of: Restriction
  max cardinality: 1
  on property: name
subclass of: Restriction
  max cardinality: 1
  on property: bezeichnung
subclass of: Restriction
  all values from: ax-tidemerkmal-meer
  max cardinality: 1
  on property: tidemerkmal
subclass of: Restriction
  max cardinality: 2
  on property: regionalsprache

Moor
type: Class
grunddatenbestand: Basis-DLM
grunddatenbestand: DLKM
grunddatenbestand: DLM50
kennung: 43005
modellart: Basis-DLM
modellart: DLKM
modellart: DLM1000
modellart: DLM250
modellart: DLM50
comment: 'Moor' ist eine unkultivierte Fläche, deren obere Schicht aus vertorften oder zersetzten Pflanzenresten besteht. Torfstich bzw. Torfabbaufläche wird der Objektart 41005 'Tagebau, Grube, Steinbruch' mit AGT 'Torf' zugeordnet.
subclass of: AX TatsaechlicheNutzung
subclass of: Restriction
  max cardinality: 1
  on property: name

Muster-und Vergleichsstück
type: Class
grunddatenbestand: DLKM
kennung: 72002
modellart: DLKM
comment: 'Muster-und Vergleichsstück' ist eine besondere bodengeschätzte Fläche nach dem BodSchätzG, die im Liegenschaftskataster nachzuweisen ist.
subclass of: AU Objekt
subclass of: Restriction
  all values from: ax-merkmal-musterundvergleichsstueck
  cardinality: 1
  on property: merkmal
subclass of: Restriction
  max cardinality: 1
  on property: nummer
subclass of: Restriction
  all values from: ax-nutzungsart-musterundvergleichsstueck
  max cardinality: 1
  on property: nutzungsart
subclass of: Restriction
  all values from: ax-bodenart-musterundvergleichsstueck
  max cardinality: 1
  on property: bodenart
subclass of: Restriction
  all values from: ax-zustandsstufe
  max cardinality: 1
  on property: zustandsstufe
subclass of: Restriction
  all values from: ax-bodenstufe
  max cardinality: 1
  on property: bodenstufe
subclass of: Restriction
  all values from: ax-entstehungsart
  max cardinality: 1
  on property: entstehungsart
subclass of: Restriction
  all values from: ax-klimastufe
  max cardinality: 1
  on property: klimastufe
subclass of: Restriction
  all values from: ax-wasserverhaeltnisse
  max cardinality: 1
  on property: wasserverhaeltnisse
subclass of: Restriction
  max cardinality: 1
  on property: bodenzahlOderGruenlandgrundzahl
subclass of: Restriction
  max cardinality: 1
  on property: ackerzahlOderGruenlandzahl
subclass of: Restriction
  max cardinality: 1
  on property: jahreszahl
subclass of: Restriction
  max cardinality: 1
  on property: qualitaetsangaben
subclass of: Restriction
  max cardinality: 1
  on property: wirdBestimmt

Namensnummer
type: Class
grunddatenbestand: DLKM
kennung: 21006
modellart: DLKM
comment: 'Namensnummer' ist die laufende Nummer der Eintragung, unter welcher der Eigentümer oder Erbbauberechtigte im Buchungsblatt geführt wird. Rechtsgemeinschaften werden auch unter AX_Namensnummer geführt.
subclass of: AA NREO
subclass of: Restriction
  max cardinality: 1
  on property: benennt
subclass of: Restriction
  max cardinality: 1
  on property: laufendeNummerNachDIN1421
subclass of: Restriction
  max cardinality: 1
  on property: nummer
subclass of: Restriction
  max cardinality: 1
  on property: anteil
subclass of: Restriction
  all values from: ax-artderrechtsgemeinschaft-namensnummer
  max cardinality: 1
  on property: artDerRechtsgemeinschaft
subclass of: Restriction
  max cardinality: 1
  on property: beschriebDerRechtsgemeinschaft
subclass of: Restriction
  all values from: ax-eigentuemerart-namensnummer
  max cardinality: 1
  on property: eigentuemerart
subclass of: Restriction
  max cardinality: 1
  on property: strichblattnummer
subclass of: Restriction
  cardinality: 1
  on property: istBestandteilVon
subclass of: Restriction
  max cardinality: 1
  on property: bestehtAusRechtsverhaeltnissenZu

Nationalstaat
type: Class
kennung: 73001
modellart: DLM1000
modellart: DLM250
comment: 'Nationalstaat' umfasst das Gebiet der Bundesrepublik Deutschland. Im Bereich der Nord- und Ostsee wird die Fläche durch die seewärtige Begrenzung der 12-Seemeilenzone definiert.
subclass of: AA NREO
subclass of: Restriction
  cardinality: 1
  on property: schluesselGesamt
subclass of: Restriction
  cardinality: 1
  on property: bezeichnung
subclass of: Restriction
  max cardinality: 1
  on property: einwohnerzahl
subclass of: Restriction
  max cardinality: 1
  on property: historisch
subclass of: Restriction
  max cardinality: 2
  on property: regionalsprache
subclass of: Restriction
  cardinality: 1
  on property: schluessel

Natur-, Umwelt- oder Bodenschutzrecht
type: Class
grunddatenbestand: Basis-DLM
grunddatenbestand: DLM50
kennung: 71006
modellart: Basis-DLM
modellart: DLKM
modellart: DLM1000
modellart: DLM250
modellart: DLM50
comment: 'Natur-, Umwelt- oder Bodenschutzrecht' ist die auf den Grund und Boden bezogene Beschränkung, Belastung oder andere Eigenschaft einer Fläche oder eines Gegenstandes nach öffentlichen, natur-, umwelt- oder bodenschutzrechtlichen Vorschriften.
subclass of: AU Objekt
subclass of: Restriction
  all values from: ax-artderfestlegung-naturumweltoderbodenschutzrecht
  cardinality: 1
  on property: artDerFestlegung
subclass of: Restriction
  max cardinality: 1
  on property: ausfuehrendeStelle
subclass of: Restriction
  max cardinality: 1
  on property: name
subclass of: Restriction
  max cardinality: 1
  on property: bezeichnung
subclass of: Restriction
  all values from: ax-zustand-naturumweltoderbodenschutzrecht
  max cardinality: 1
  on property: zustand
subclass of: Restriction
  max cardinality: 1
  on property: qualitaetsangaben

Netzknoten
type: Class
kennung: 56001
modellart: Basis-DLM
comment: 'Netzknoten' ist ein plangleicher (höhengleicher) und planfreier (höhenungleicher) Knotenpunkt, der sich aus der verkehrlichen Verknüpfung zweier oder mehrerer Straßen des aufzunehmenden Straßennetzes ergibt.
subclass of: AA ZUSO
subclass of: Restriction
  all values from: ax-ergebnisderueberpruefung-bauwerkeeinrichtungenundsonstigeangaben
  max cardinality: 1
  on property: ergebnisDerUeberpruefung
subclass of: Restriction
  max cardinality: 1
  on property: qualitaetsangaben
subclass of: Restriction
  cardinality: 1
  on property: bezeichnung

Netzpunkt
type: Class
grunddatenbestand: DLKM
kennung: 13004
modellart: DLKM
comment: 'Netzpunkt' ist eine Klasse, die allgemeingültige Eigenschaften für alle Objektarten dieser Objektartengruppe enthält.
subclass of: AA ZUSO
subclass of: Restriction
  max cardinality: 1
  on property: punktkennung
subclass of: Restriction
  max cardinality: 1
  on property: zustaendigeStelle
subclass of: Restriction
  all values from: ax-horizontfreiheit-netzpunkt
  max cardinality: 1
  on property: horizontfreiheit
subclass of: Restriction
  max cardinality: 1
  on property: relativeHoehe
subclass of: Restriction
  all values from: ax-marke
  cardinality: 1
  on property: vermarkung Marke

Nullpunkt
type: Class
kennung: 56002
modellart: Basis-DLM
comment: 'Nullpunkt' ist der Anfangs- oder Endpunkt eines Abschnittes und Astes, an dem die Stationierung beginnt bzw. endet. Der Nullpunkt ist einem Netzknoten zugeordnet und wird durch einen Buchstaben gekennzeichnet, der an die Netzknotennummer angehängt wird. Jeder Netzknoten hat einen zentralen Nullpunkt. Dieser erhält in der Regel den Buchstabenzusatz 'O'. Gehören zu einem Netzknoten mehrere Nullpunkte, dann wird einer als zentraler Nullpunkt festgelegt.
subclass of: AU Punktobjekt
subclass of: Restriction
  all values from: ax-ergebnisderueberpruefung-bauwerkeeinrichtungenundsonstigeangaben
  max cardinality: 1
  on property: ergebnisDerUeberpruefung
subclass of: Restriction
  max cardinality: 1
  on property: qualitaetsangaben
subclass of: Restriction
  all values from: ax-artdesnullpunktes-nullpunkt
  cardinality: 1
  on property: artDesNullpunktes
subclass of: Restriction
  cardinality: 1
  on property: bezeichnung

AX Nutzung Gebaeude
type: Class
kennung: 31006
modellart: Basis-DLM
modellart: DLKM
modellart: DLM50
subclass of: AbstractObject

Oeffnung3D
type: Class
kennung: 101029
modellart: LoD3
comment: 'Oeffnung3D' ist eine abstrakte Objektart und vererbt ihre Eigenschaften an die Begrenzungsflächen eines Bauteils 3D 'Fenster3D' und 'Tuer3D'.
subclass of: AU MehrfachFlaechenObjekt 3D
subclass of: Restriction
  max cardinality: 1
  on property: istEnthaltenIn

Ortslage
type: Class
grunddatenbestand: Basis-DLM
grunddatenbestand: DLM50
kennung: 52001
modellart: Basis-DLM
modellart: DLKM
modellart: DLM1000
modellart: DLM250
modellart: DLM50
comment: 'Ortslage' ist eine im Zusammenhang bebaute Fläche. Die Ortslage enthält neben 'Wohnbaufläche', 'Industrie- und Gewerbefläche', 'Fläche gemischter Nutzung', 'Fläche besonderer funktionaler Prägung' auch die dazu in einem engen räumlichen und funktionalen Zusammenhang stehenden Flächen des Verkehrs, von Gewässern, von Flächen, die von 'Bauwerke und sonstige Einrichtungen' für Erholung, Sport und Freizeit belegt sind, sowie von 'Vegetationsflächen'. Die Grenze der Ortslage zur Feldlage oder zu Waldflächen wird in der Regel durch die Grenzen der bebauten Grundstücke unter Einbeziehung der Hofraumflächen und Hausgärten gebildet. Der Umring bildet einen geschlossenen Linienzug. Die Ortslage kann Objekte des Objektartenbereichs 'Vegetation' als Inseln umschließen. Bei Vergabe des Namens (NAM) ist streng nach einer Hierarchie zu verfahren. Es wird jeweils der Name der niedrigsten zutreffenden Hierarchiestufe (Wohnplatz, Gemeindeteil, Gemeinde) vergeben, in dem die Ortslage vollständig liegt.
subclass of: AU Objekt
subclass of: Restriction
  all values from: ax-ergebnisderueberpruefung-bauwerkeeinrichtungenundsonstigeangaben
  max cardinality: 1
  on property: ergebnisDerUeberpruefung
subclass of: Restriction
  max cardinality: 1
  on property: qualitaetsangaben
subclass of: Restriction
  max cardinality: 1
  on property: name
subclass of: Restriction
  max cardinality: 1
  on property: zweitname
subclass of: Restriction
  max cardinality: 2
  on property: regionalsprache

Person
type: Class
grunddatenbestand: DLKM
kennung: 21001
modellart: Basis-DLM
modellart: DFGM
modellart: DLKM
modellart: DLM50
comment: 'Person' ist eine natürliche oder juristische Person und kann z.B. in den Rollen Eigentümer, Erwerber, Verwalter oder Vertreter in Katasterangelegenheiten geführt werden.
subclass of: AA NREO
subclass of: Restriction
  cardinality: 1
  on property: nachnameOderFirma
subclass of: Restriction
  all values from: ax-anrede-person
  max cardinality: 1
  on property: anrede
subclass of: Restriction
  max cardinality: 1
  on property: vorname
subclass of: Restriction
  max cardinality: 1
  on property: namensbestandteil
subclass of: Restriction
  max cardinality: 1
  on property: akademischerGrad
subclass of: Restriction
  max cardinality: 1
  on property: geburtsname
subclass of: Restriction
  max cardinality: 1
  on property: geburtsdatum
subclass of: Restriction
  max cardinality: 1
  on property: wohnortOderSitz
subclass of: Restriction
  max cardinality: 1
  on property: beruf
subclass of: Restriction
  max cardinality: 1
  on property: sonstigeEigenschaften
subclass of: Restriction
  max cardinality: 1
  on property: haushaltsstelleLandesgrundbesitz
subclass of: Restriction
  max cardinality: 1
  on property: qualitaetsangaben
subclass of: Restriction
  max cardinality: 1
  on property: zeigtAuf
subclass of: Restriction
  max cardinality: 1
  on property: rufname
subclass of: Restriction
  max cardinality: 1
  on property: sterbedatum

Personengruppe
type: Class
kennung: 21002
modellart: DLKM
comment: 'Personengruppe' ist die Zusammenfassung von Personen unter einem Ordnungsbegriff. Die Information wird nach Einführung des Datenbankgrundbuches (DaBaG) von der Grundbuchverwaltung nicht mehr übermittelt.
subclass of: AA NREO
subclass of: Restriction
  cardinality: 1
  on property: nameDerPersonengruppe
subclass of: Restriction
  min cardinality: 2
  on property: bestehtAus

AX Pfeilerhoehe Lagefestpunkt
type: Class
grunddatenbestand: DFGM
kennung: 19007
modellart: DFGM
comment: Die 'Pfeilerhöhe' gibt bei Vermarkungen, die aus Pfeiler und Platte bestehen, die Höhendifferenz Pfeileroberfläche minus Plattenoberfläche sowie das Messdatum an.
subclass of: AbstractObject

Platz
type: Class
grunddatenbestand: Basis-DLM
grunddatenbestand: DLKM
grunddatenbestand: DLM50
kennung: 42009
modellart: Basis-DLM
modellart: DLKM
modellart: DLM50
comment: 'Platz' ist eine Verkehrsfläche in Ortschaften oder eine ebene, befestigte oder unbefestigte Fläche, die bestimmten Zwecken dient (z. B. für Verkehr, Parkplätze, Märkte, Festveranstaltungen).
subclass of: AX TatsaechlicheNutzung
subclass of: Restriction
  all values from: ax-funktion-platz
  max cardinality: 1
  on property: funktion
subclass of: Restriction
  max cardinality: 1
  on property: name
subclass of: Restriction
  max cardinality: 1
  on property: strassenschluessel
subclass of: Restriction
  max cardinality: 2
  on property: regionalsprache

Polder
type: Class
kennung: 55003
modellart: Basis-DLM
modellart: DLKM
comment: 'Polder' ist eine eingedeichte Fläche innerhalb eines Überschwemmungsgebietes, die zum Schutz vor Überflutung ereignisabhängig oder regelmäßig geflutet werden kann.
subclass of: AU Flaechenobjekt
subclass of: Restriction
  all values from: ax-ergebnisderueberpruefung-bauwerkeeinrichtungenundsonstigeangaben
  max cardinality: 1
  on property: ergebnisDerUeberpruefung
subclass of: Restriction
  max cardinality: 1
  on property: qualitaetsangaben
subclass of: Restriction
  max cardinality: 1
  on property: name
subclass of: Restriction
  all values from: ax-artdespolders
  max cardinality: 1
  on property: artDesPolders
subclass of: Restriction
  all values from: ax-funktion-polder
  max cardinality: 1
  on property: funktion

AX Portionierungsparameter
type: Class
kennung: 81008
comment: Alle REO und deren anhängende NREO und ZUSO, die innerhalb eines Portionsquadrates - die Größe wird durch 'seitenlaenge' bestimmt - liegen, gemeinsam in eine Portion. Anhängende NREO und ZUSO werden nur in der jeweils ersten Portion ihres Auftretens abgegeben. Siehe auch GeoInfoDok, Kapitel 10. Die Portionen einer Lieferung werden über geeignete Kennungen als zusammengehörig kenntlich gemacht. Die Benennung folgt einer automatisiert auswertbaren Logik, die sich an der Art der Portionierung orientiert: <NBA-Profilkennung > <_> <Datum der NBA-Erzeugung im Format jjmmtt > <_> <Laufende Nummer der Portion, ohne führende Nullen> <von> <Gesamtzahl der Portionen der Lieferung, ohne führende Nullen> <_> <Portionierungsartabhängiger Dateinamensanteil>
subclass of: AbstractObject

AX Post
type: Class
kennung: 12007
modellart: DLKM
subclass of: AbstractObject

Punkt3D
type: Class
grunddatenbestand: DHM
kennung: 62020
modellart: Basis-DLM
modellart: DHM
modellart: DLKM
modellart: DLM1000
modellart: DLM250
modellart: DLM50
comment: 'Punkt3D' beschreiben einen einzelnen 3D-Messpunkt, der eine besondere Bedeutung hat und/oder sehr markant ist. Neben 3D-CRS und CCRS (Compound Coordinate Reference System) dürfen auch 2D-CRS verwendet werden.
subclass of: AU Punktobjekt
subclass of: Restriction
  all values from: ax-art-punkt3d
  max cardinality: 1
  on property: art
subclass of: Restriction
  max cardinality: 1
  on property: qualitaetsangaben

Punktkennung untergegangen
type: Class
kennung: 16002
modellart: DLKM
comment: 'Punktkennung untergegangen' enthält Punktkennungen, die untergegangen sind.
subclass of: AA NREO
subclass of: Restriction
  cardinality: 1
  on property: punktkennung
subclass of: Restriction
  all values from: ax-art-punktkennung
  max cardinality: 1
  on property: art

Punktkennung vergleichend
type: Class
kennung: 16003
modellart: DLKM
comment: 'Punktkennung vergleichend' enthält vorläufige Punktkennungen.
subclass of: AA NREO
subclass of: Restriction
  cardinality: 1
  on property: vorlaeufigePunktkennung
subclass of: Restriction
  cardinality: 1
  on property: endgueltigePunktkennung
subclass of: Restriction
  all values from: ax-art-punktkennung
  max cardinality: 1
  on property: art
subclass of: Restriction
  cardinality: 1
  on property: antragsnummer

PunktortAG
type: Class
kennung: 14002
modellart: DLKM
comment: 'PunktortAG' ist ein Punktort mit redundanzfreier Geometrie (Besonderer Gebäudepunkt, Besonderer Bauwerkspunkt) innerhalb eines Geometriethemas.
subclass of: AG Punktobjekt
subclass of: Restriction
  max cardinality: 1
  on property: kartendarstellung
subclass of: Restriction
  all values from: ax-koordinatenstatus-punktort
  max cardinality: 1
  on property: koordinatenstatus
subclass of: Restriction
  max cardinality: 1
  on property: ueberpruefungsdatum
subclass of: Restriction
  max cardinality: 1
  on property: hinweise
subclass of: Restriction
  max cardinality: 1
  on property: qualitaetsangaben

PunktortAU
type: Class
grunddatenbestand: DFGM
grunddatenbestand: DLKM
kennung: 14003
modellart: DFGM
modellart: DLKM
comment: 'PunktortAU' ist ein Punktort mit unabhängiger Geometrie ohne Zugehörigkeit zu einem Geometriethema. Er kann zu ZUSOs der folgenden Objektarten gehören: Grenzpunkt, Besonderer Gebäudepunkt, Besonderer Bauwerkspunkt, Aufnahmepunkt, Sicherungspunkt, Sonstiger Vermessungspunkt, Besonderer topographischer Punkt, Lagefestpunkt, Höhenfestpunkt, Schwerefestpunkt, Referenzstationspunkt.
subclass of: AU Punktobjekt
subclass of: Restriction
  max cardinality: 1
  on property: kartendarstellung
subclass of: Restriction
  all values from: ax-koordinatenstatus-punktort
  max cardinality: 1
  on property: koordinatenstatus
subclass of: Restriction
  max cardinality: 1
  on property: ueberpruefungsdatum
subclass of: Restriction
  max cardinality: 1
  on property: hinweise
subclass of: Restriction
  max cardinality: 1
  on property: qualitaetsangaben

PunktortTA
type: Class
grunddatenbestand: DLKM
kennung: 14004
modellart: DLKM
comment: 'PunktortTA' ist ein Punktort, der in der Flurstücksgrenze liegt und einen Grenzpunkt verortet.
subclass of: TA PointComponent
subclass of: Restriction
  max cardinality: 1
  on property: kartendarstellung
subclass of: Restriction
  all values from: ax-koordinatenstatus-punktort
  max cardinality: 1
  on property: koordinatenstatus
subclass of: Restriction
  max cardinality: 1
  on property: ueberpruefungsdatum
subclass of: Restriction
  max cardinality: 1
  on property: hinweise
subclass of: Restriction
  max cardinality: 1
  on property: qualitaetsangaben

Punktstabilität
type: Class
kennung: 19111
modellart: DFGM
comment: 'Punktstabilität' gibt die vermutete bzw. nachgewiesene Höhenstabilität der Punktvermarkung in acht Einzelinformationen an.
subclass of: AbstractObject

Punktwolke3D
type: Class
grunddatenbestand: DHM
kennung: 62010
modellart: DHM
comment: 'Punktwolke3D' beschreibt eine Menge von Messpunkten mit gleicher Herkunft und Qualität, die zur Modellierung der Erdoberfläche verwendet werden.
subclass of: AD PunktCoverage
subclass of: Restriction
  all values from: ax-art-punktwolke3d
  max cardinality: 1
  on property: art
subclass of: Restriction
  max cardinality: 1
  on property: qualitaetsangaben

Referenzstationspunkt
type: Class
grunddatenbestand: DFGM
kennung: 19004
modellart: DFGM
comment: 'Referenzstationspunkt' (RSP) ist ein 3D-Festpunkt, der zur Punktgruppe einer SAPOS-Referenzstation gehört.
subclass of: AX Festpunkt
subclass of: Restriction
  all values from: ax-funktion-referenzstationspunkt
  max cardinality: 1
  on property: funktion
subclass of: Restriction
  max cardinality: 1
  on property: qualitaetsangaben
subclass of: Restriction
  max cardinality: 1
  on property: istIdentischMitLFP
subclass of: Restriction
  max cardinality: 1
  on property: istIdentischMitHFP

Regierungsbezirk
type: Class
grunddatenbestand: Basis-DLM
grunddatenbestand: DLKM
grunddatenbestand: DLM50
kennung: 73003
modellart: Basis-DLM
modellart: DFGM
modellart: DLKM
modellart: DLM1000
modellart: DLM250
modellart: DLM50
comment: 'Regierungsbezirk' enthält alle zur Regierungsbezirksebene zählenden Verwaltungseinheiten innerhalb eines Bundeslandes.
subclass of: AA NREO
subclass of: Restriction
  cardinality: 1
  on property: schluesselGesamt
subclass of: Restriction
  cardinality: 1
  on property: bezeichnung
subclass of: Restriction
  max cardinality: 1
  on property: einwohnerzahl
subclass of: Restriction
  max cardinality: 1
  on property: historisch
subclass of: Restriction
  max cardinality: 2
  on property: regionalsprache
subclass of: Restriction
  cardinality: 1
  on property: schluessel

AX Regierungsbezirk Schluessel
type: Class
grunddatenbestand: Basis-DLM
grunddatenbestand: DLKM
grunddatenbestand: DLM50
kennung: 73021
modellart: Basis-DLM
modellart: DFGM
modellart: DLKM
modellart: DLM1000
modellart: DLM250
modellart: DLM50
comment: Amtliche Verschlüsselung des Regierungsbezirks.
subclass of: AbstractObject

AX RelativeHoehe
type: Class
kennung: 31008
modellart: Basis-DLM
modellart: DLKM
modellart: DLM1000
modellart: DLM250
modellart: DLM50
modellart: LoD1
modellart: LoD2
modellart: LoD3
comment: Der Datentyp 'Relative Höhe’ beschreibt alle Informationen, die zur Angabe einer relativen Höhe zwischen zwei Bezugspunkten benötigt werden. Die Höhendifferenz 'hoehe' wird in Meter angegeben.
subclass of: AbstractObject

Reservierung
type: Class
kennung: 16001
modellart: DFGM
modellart: DLKM
comment: 'Reservierung' enthält Ordnungsnummern des Liegenschaftskatasters, die für eine durchzuführende Vermessungssache reserviert sind.
subclass of: AA NREO
subclass of: Restriction
  all values from: ax-art-reservierung
  cardinality: 1
  on property: art
subclass of: Restriction
  cardinality: 1
  on property: nummer
subclass of: Restriction
  cardinality: 1
  on property: vermessungsstelle
subclass of: Restriction
  max cardinality: 1
  on property: ablaufDerReservierung
subclass of: Restriction
  max cardinality: 1
  on property: antragsnummer
subclass of: Restriction
  max cardinality: 1
  on property: auftragsnummer
subclass of: Restriction
  max cardinality: 1
  on property: nummerierungsbezirk
subclass of: Restriction
  max cardinality: 1
  on property: gebietskennung

AX Reservierungsauftrag Gebietskennung
type: Class
kennung: 16004
modellart: DLKM
subclass of: AbstractObject

Schifffahrtslinie, Fährverkehr
type: Class
grunddatenbestand: Basis-DLM
grunddatenbestand: DLM50
kennung: 57002
modellart: Basis-DLM
modellart: DLKM
modellart: DLM1000
modellart: DLM250
modellart: DLM50
comment: 'Schifffahrtslinie, Fährverkehr' ist die regelmäßige Schiffs- oder Fährverbindung.
subclass of: AG Objekt
subclass of: Restriction
  all values from: ax-ergebnisderueberpruefung-bauwerkeeinrichtungenundsonstigeangaben
  max cardinality: 1
  on property: ergebnisDerUeberpruefung
subclass of: Restriction
  max cardinality: 1
  on property: qualitaetsangaben
subclass of: Restriction
  all values from: ax-art-schifffahrtsliniefaehrverkehr
  min cardinality: 1
  on property: art
subclass of: Restriction
  max cardinality: 1
  on property: name

Schiffsverkehr
type: Class
grunddatenbestand: Basis-DLM
grunddatenbestand: DLKM
grunddatenbestand: DLM50
kennung: 42016
modellart: Basis-DLM
modellart: DLKM
modellart: DLM50
comment: 'Schiffsverkehr' umfasst die baulich geprägte Fläche und die mit ihr in Zusammenhang stehende Freifläche, die ausschließlich oder vorwiegend dem Schiffsverkehr dient.
subclass of: AX TatsaechlicheNutzung
subclass of: Restriction
  all values from: ax-funktion-schiffsverkehr
  max cardinality: 1
  on property: funktion
subclass of: Restriction
  max cardinality: 1
  on property: name
subclass of: Restriction
  all values from: ax-zustand-schiffsverkehr
  max cardinality: 1
  on property: zustand

AX Schleuse
type: Class
grunddatenbestand: Basis-DLM
grunddatenbestand: DLM50
kennung: 52003
modellart: Basis-DLM
modellart: DLKM
modellart: DLM1000
modellart: DLM250
modellart: DLM50
comment: Anlage zur Überführung von Wasserfahrzeugen zwischen Gewässern verschiedener Wasserspiegelhöhen einschließlich der Betriebsflächen und -gebäude.
subclass of: AU Objekt
subclass of: Restriction
  all values from: ax-ergebnisderueberpruefung-bauwerkeeinrichtungenundsonstigeangaben
  max cardinality: 1
  on property: ergebnisDerUeberpruefung
subclass of: Restriction
  max cardinality: 1
  on property: qualitaetsangaben
subclass of: Restriction
  max cardinality: 1
  on property: bezeichnung
subclass of: Restriction
  all values from: ax-konstruktionsmerkmalbauart-schleuse
  max cardinality: 1
  on property: konstruktionsmerkmalBauart
subclass of: Restriction
  max cardinality: 1
  on property: name
subclass of: Restriction
  all values from: ax-zustand-schleuse
  max cardinality: 1
  on property: zustand

Schutzgebiet nach Natur-, Umwelt- oder Bodenschutzrecht
type: Class
grunddatenbestand: Basis-DLM
grunddatenbestand: DLM50
kennung: 71007
modellart: Basis-DLM
modellart: DLKM
modellart: DLM1000
modellart: DLM250
modellart: DLM50
comment: 'Schutzgebiet nach Natur-, Umwelt- oder Bodenschutzrecht' ist ein fachlich übergeordnetes Gebiet von Flächen mit bodenbezogenen Beschränkungen, Belastungen oder anderen Eigenschaften nach öffentlichen Vorschriften.
subclass of: AA ZUSO
subclass of: Restriction
  all values from: ax-artderfestlegung-schutzgebietnachnaturumweltoderbodenschutzrecht
  cardinality: 1
  on property: artDerFestlegung
subclass of: Restriction
  max cardinality: 1
  on property: ausfuehrendeStelle
subclass of: Restriction
  max cardinality: 1
  on property: name
subclass of: Restriction
  max cardinality: 1
  on property: nummerDesSchutzgebietes
subclass of: Restriction
  max cardinality: 1
  on property: qualitaetsangaben

Schutzgebiet nach Wasserrecht
type: Class
kennung: 71005
modellart: Basis-DLM
modellart: DLKM
modellart: DLM50
comment: 'Schutzgebiet nach Wasserrecht' ist ein fachlich übergeordnetes Gebiet von Flächen mit bodenbezogenen Beschränkungen, Belastungen oder anderen Eigenschaften nach öffentlichen, wasserrechtlichen Vorschriften.
subclass of: AA ZUSO
subclass of: Restriction
  all values from: ax-artderfestlegung-schutzgebietnachwasserrecht
  cardinality: 1
  on property: artDerFestlegung
subclass of: Restriction
  max cardinality: 1
  on property: ausfuehrendeStelle
subclass of: Restriction
  all values from: ax-funktion-schutzgebietnachwasserrecht
  max cardinality: 1
  on property: funktion
subclass of: Restriction
  max cardinality: 1
  on property: name
subclass of: Restriction
  max cardinality: 1
  on property: nummerDesSchutzgebietes
subclass of: Restriction
  max cardinality: 1
  on property: qualitaetsangaben

Schutzzone
type: Class
grunddatenbestand: Basis-DLM
grunddatenbestand: DLM50
kennung: 71012
modellart: Basis-DLM
modellart: DLKM
modellart: DLM1000
modellart: DLM250
modellart: DLM50
comment: 'Schutzzone' ist die auf den Grund und Boden bezogene Beschränkung, Belastung oder andere Eigenschaft einer Fläche nach öffentlichen oder wasserrechtlichen Vorschriften.
subclass of: AU Flaechenobjekt
subclass of: Restriction
  all values from: ax-zone-schutzzone
  cardinality: 1
  on property: zone
subclass of: Restriction
  all values from: ax-rechtszustand-schutzzone
  max cardinality: 1
  on property: rechtszustand
subclass of: Restriction
  max cardinality: 1
  on property: nummerDerSchutzzone

AX Schwere
type: Class
grunddatenbestand: DFGM
kennung: 14005
modellart: DFGM
comment: Ein Objekt 'Schwere' definiert einen Schwerewert und / oder eine oder mehrere Schwereanomalien und / oder einen gemessenen vertikalen Schweregradienten eines Objektes der Objektarten 'Lagefestpunkt', 'Höhenfestpunkt', 'Schwerefestpunkt' oder 'Referenzstationspunkt' in einem zugehörigen Schwerebezugssystem.
subclass of: AA NREO
subclass of: Restriction
  max cardinality: 1
  on property: schwerewert
subclass of: Restriction
  all values from: ax-schwerebezugssystem-schwere
  cardinality: 1
  on property: schwerebezugssystem
subclass of: Restriction
  all values from: ax-schwerestatus-schwere
  max cardinality: 1
  on property: schwerestatus
subclass of: Restriction
  max cardinality: 1
  on property: aufstellhoehe
subclass of: Restriction
  max cardinality: 1
  on property: ueberpruefungsdatum
subclass of: Restriction
  max cardinality: 1
  on property: hinweise
subclass of: Restriction
  max cardinality: 1
  on property: qualitaetsangaben
subclass of: Restriction
  max cardinality: 1
  on property: vertikalerSchweregradient

AX Schwereanomalie Schwere
type: Class
kennung: 14007
modellart: DFGM
comment: Angaben zur Schwereanomalie eines Schwere-Objekts.
subclass of: AbstractObject

Schwerefestpunkt
type: Class
grunddatenbestand: DFGM
kennung: 19003
modellart: DFGM
comment: 'Schwerefestpunkt' (SFP) ist ein Schwerepunkt, der im amtlichen Nachweis der Schwerefestpunkte geführt wird. Koordinaten, Höhen und Schwerewerte des SFP beziehen sich auf die Vermarkung, nicht auf den Gravimeteraufstellort.
subclass of: AX Festpunkt
subclass of: Restriction
  all values from: ax-ordnung-schwerefestpunkt
  max cardinality: 1
  on property: ordnung
subclass of: Restriction
  all values from: ax-funktion-schwerefestpunkt
  max cardinality: 1
  on property: funktion
subclass of: Restriction
  max cardinality: 1
  on property: qualitaetsangaben
subclass of: Restriction
  max cardinality: 1
  on property: istIdentischMitLFP
subclass of: Restriction
  max cardinality: 1
  on property: unterschiedlicherBezugspunktMitLFP
subclass of: Restriction
  max cardinality: 1
  on property: istIdentischMitHFP
subclass of: Restriction
  max cardinality: 1
  on property: unterschiedlicherBezugspunktMitHFP
subclass of: Restriction
  max cardinality: 1
  on property: istIdentischMitAP
subclass of: Restriction
  max cardinality: 1
  on property: istIdentischMitSP
subclass of: Restriction
  max cardinality: 1
  on property: istIdentischMitSVP
subclass of: Restriction
  max cardinality: 1
  on property: istIdentischMitGrenzpunkt
subclass of: Restriction
  max cardinality: 1
  on property: istExzentrumZu

Seilbahn, Schwebebahn
type: Class
grunddatenbestand: Basis-DLM
grunddatenbestand: DLM50
kennung: 53005
modellart: Basis-DLM
modellart: DLKM
modellart: DLM1000
modellart: DLM250
modellart: DLM50
comment: 'Seilbahn, Schwebebahn' ist eine Beförderungseinrichtung, bei der Waggons, Kabinen oder sonstige Behälter an Seilen oder festen Schienen aufgehängt sind und sich an diesen entlang bewegen.
subclass of: AU Linienobjekt
subclass of: Restriction
  all values from: ax-ergebnisderueberpruefung-bauwerkeeinrichtungenundsonstigeangaben
  max cardinality: 1
  on property: ergebnisDerUeberpruefung
subclass of: Restriction
  max cardinality: 1
  on property: qualitaetsangaben
subclass of: Restriction
  all values from: ax-bahnkategorie-seilbahnschwebebahn
  cardinality: 1
  on property: bahnkategorie
subclass of: Restriction
  max cardinality: 1
  on property: name

Sicherungspunkt
type: Class
kennung: 13002
modellart: DLKM
comment: 'Sicherungspunkt' ist ein Punkt des Netzpunktfeldes, der vermarkt ist und der Sicherung eines Aufnahmepunktes oder Sonstigen Vermessungspunktes dient.
subclass of: Netzpunkt
subclass of: Restriction
  max cardinality: 1
  on property: gehoertZu
subclass of: Restriction
  max cardinality: 1
  on property: beziehtSichAuf

Sickerstrecke
type: Class
grunddatenbestand: Basis-DLM
grunddatenbestand: DLM50
kennung: 57004
modellart: Basis-DLM
modellart: DLKM
modellart: DLM50
comment: 'Sickerstrecke' bedeutet, dass ein Gewässer unter der Erdoberfläche durch Lockergestein verläuft.
subclass of: AG Linienobjekt
subclass of: Restriction
  all values from: ax-ergebnisderueberpruefung-bauwerkeeinrichtungenundsonstigeangaben
  max cardinality: 1
  on property: ergebnisDerUeberpruefung
subclass of: Restriction
  max cardinality: 1
  on property: qualitaetsangaben
subclass of: Restriction
  max cardinality: 1
  on property: name
subclass of: Restriction
  max cardinality: 1
  on property: zweitname
subclass of: Restriction
  max cardinality: 1
  on property: gewaesserkennzahl
subclass of: Restriction
  cardinality: 1
  on property: fliessrichtung

Siedlungsfläche
type: Class
grunddatenbestand: DLM50
kennung: 41010
modellart: DLM250
modellart: DLM50
comment: 'Siedlungsfläche' ist eine baulich geprägte Fläche. Sie beschreibt: - reine Wohnbauflächen - städtische Zentren mit Handelsbetrieben, Einrichtungen für Wirtschaft und Verwaltung, Handwerksbetriebe, Einrichtungen für kirchliche, kulturelle, soziale und gesundheitliche Zwecke - ländlich-dörflich Ansiedlungen mit land- und forstwirtschaftlichen Betrieben.
subclass of: AX TatsaechlicheNutzung
subclass of: Restriction
  all values from: ax-artderbebauung-siedlungsflaeche
  max cardinality: 1
  on property: artDerBebauung
subclass of: Restriction
  max cardinality: 1
  on property: name
subclass of: Restriction
  all values from: ax-funktion-siedlungsflaeche
  max cardinality: 1
  on property: funktion
subclass of: Restriction
  max cardinality: 2
  on property: regionalsprache

AX Skizze
type: Class
grunddatenbestand: DFGM
kennung: 19005
modellart: DFGM
comment: Ein Objekt der Objektart 'Skizze' ergänzt ein oder mehrere Objekte 'Lagefestpunkt', 'Höhenfestpunkt', 'Schwerefestpunkt' oder 'Referenzstationspunkt'. Es beinhaltet die URI einer Datei, welche eine Einmessungsskizze, ein Foto oder eine ähnliche grafische oder sonstige Information zu dem jeweiligen Festpunkt enthält.
subclass of: AA NREO
subclass of: Restriction
  cardinality: 1
  on property: skizzenname
subclass of: Restriction
  all values from: ax-skizzenart-skizze
  max cardinality: 1
  on property: skizzenart
subclass of: Restriction
  max cardinality: 1
  on property: bemerkungen

Soll
type: Class
kennung: 61010
modellart: Basis-DLM
modellart: DLKM
comment: 'Soll' ist eine runde, oft steilwandige Vertiefung in den norddeutschen Grundmoränenlandschaften; kann durch Abschmelzen von überschütteten Toteisblöcken (Toteisloch) oder durch Schmelzen periglazialer Eislinsen entstanden sein.
subclass of: AU Flaechenobjekt
subclass of: Restriction
  max cardinality: 1
  on property: name
subclass of: Restriction
  max cardinality: 1
  on property: qualitaetsangaben

AX SonstigeEigenschaften Flurstueck
type: Class
kennung: 11006
modellart: DLKM
comment: Der Datentyp setzt sich zusammen aus: 1. Kennung, Schlüssel gemäß Festlegung im ALB 2. Fläche des Abschnitts in Quadratmeter 3. Angaben zum Abschnitt/Flurstück (unstrukturiert) 4. Angaben zum Abschnitt - Stelle 5. Angaben zum Abschnitt - Nummer, Aktenzeichen 6. Angaben zum Abschnitt - Bemerkung, Die Angaben zum Abschnitt/Flurstück sind unstrukturiert (3. Stelle) oder strukturiert (4. - 6. Stelle).
subclass of: AbstractObject

Sonstiger Vermessungspunkt
type: Class
kennung: 13003
modellart: DLKM
comment: 'Sonstiger Vermessungspunkt' ist ein Punkt des Aufnahmepunktfeldes, der weder Aufnahmepunkt noch Sicherungspunkt ist (z. B. Polygonpunkt, Liniennetzpunkt).
subclass of: Netzpunkt
subclass of: Restriction
  max cardinality: 1
  on property: art

Sonstiges Bauwerk oder sonstige Einrichtung
type: Class
grunddatenbestand: Basis-DLM
grunddatenbestand: DLM50
kennung: 51009
modellart: Basis-DLM
modellart: DLKM
modellart: DLM1000
modellart: DLM250
modellart: DLM50
comment: 'Sonstiges Bauwerk oder sonstige Einrichtung' ist ein Bauwerk oder eine Einrichtung, das/die nicht zu den anderen Objektarten der Objektartengruppe Bauwerke und Einrichtungen gehört.
subclass of: AG Objekt
subclass of: Restriction
  all values from: ax-ergebnisderueberpruefung-bauwerkeeinrichtungenundsonstigeangaben
  max cardinality: 1
  on property: ergebnisDerUeberpruefung
subclass of: Restriction
  max cardinality: 1
  on property: qualitaetsangaben
subclass of: Restriction
  all values from: ax-bauwerksfunktion-sonstigesbauwerkodersonstigeeinrichtung
  cardinality: 1
  on property: bauwerksfunktion
subclass of: Restriction
  max cardinality: 1
  on property: name
subclass of: Restriction
  all values from: ax-hydrologischesmerkmal-sonstigesbauwerkodersonstigeeinrichtung
  max cardinality: 1
  on property: hydrologischesMerkmal
subclass of: Restriction
  all values from: ax-funktion-bauwerk
  max cardinality: 1
  on property: funktion
subclass of: Restriction
  max cardinality: 1
  on property: bezeichnung
subclass of: Restriction
  all values from: ax-dachform
  max cardinality: 1
  on property: dachform
subclass of: Restriction
  max cardinality: 1
  on property: gehoertZu
subclass of: Restriction
  max cardinality: 1
  on property: gehoertZuBauwerk AX Leitung
subclass of: Restriction
  max cardinality: 1
  on property: gehoertZuBauwerk AX Netzknoten
subclass of: Restriction
  max cardinality: 1
  on property: gehoertZuBauwerk AX BauwerkOderAnlageFuerSportFreizeitUndErholung
subclass of: Restriction
  max cardinality: 1
  on property: gehoertZuBauwerk AX Ast
subclass of: Restriction
  max cardinality: 1
  on property: gehoertZuBauwerk AX Sickerstrecke
subclass of: Restriction
  max cardinality: 1
  on property: gehoertZuBauwerk AX EinrichtungInOeffentlichenBereichen
subclass of: Restriction
  max cardinality: 1
  on property: gehoertZuBauwerk AX Bahnverkehrsanlage
subclass of: Restriction
  max cardinality: 1
  on property: gehoertZuBauwerk AX Ortslage
subclass of: Restriction
  max cardinality: 1
  on property: gehoertZuBauwerk AX UntergeordnetesGewaesser
subclass of: Restriction
  max cardinality: 1
  on property: gehoertZuBauwerk AX Flugverkehrsanlage
subclass of: Restriction
  max cardinality: 1
  on property: gehoertZuBauwerk AX BauwerkOderAnlageFuerIndustrieUndGewerbe
subclass of: Restriction
  max cardinality: 1
  on property: gehoertZuBauwerk AX Wasserspiegelhoehe
subclass of: Restriction
  max cardinality: 1
  on property: gehoertZuBauwerk AX BauwerkImVerkehrsbereich
subclass of: Restriction
  max cardinality: 1
  on property: gehoertZuBauwerk AX SchifffahrtslinieFaehrverkehr
subclass of: Restriction
  max cardinality: 1
  on property: gehoertZuBauwerk AX Schleuse
subclass of: Restriction
  max cardinality: 1
  on property: gehoertZuBauwerk AX Transportanlage
subclass of: Restriction
  max cardinality: 1
  on property: gehoertZuBauwerk AX Grenzuebergang
subclass of: Restriction
  max cardinality: 1
  on property: gehoertZuBauwerk AX Nullpunkt
subclass of: Restriction
  max cardinality: 1
  on property: gehoertZuBauwerk AX WegPfadSteig
subclass of: Restriction
  max cardinality: 1
  on property: gehoertZuBauwerk AX SonstigesBauwerkOderSonstigeEinrichtung
subclass of: Restriction
  max cardinality: 1
  on property: gehoertZuBauwerk AX Turm
subclass of: Restriction
  max cardinality: 1
  on property: gehoertZuBauwerk AX Hafen
subclass of: Restriction
  max cardinality: 1
  on property: gehoertZuBauwerk AX Gewaessermerkmal
subclass of: Restriction
  max cardinality: 1
  on property: gehoertZuBauwerk AX BauwerkImGewaesserbereich
subclass of: Restriction
  max cardinality: 1
  on property: gehoertZuBauwerk AX Strassenverkehrsanlage
subclass of: Restriction
  max cardinality: 1
  on property: gehoertZuBauwerk AX VorratsbehaelterSpeicherbauwerk
subclass of: Restriction
  max cardinality: 1
  on property: gehoertZuBauwerk AX HistorischesBauwerkOderHistorischeEinrichtung
subclass of: Restriction
  max cardinality: 1
  on property: gehoertZuBauwerk AX Gleis
subclass of: Restriction
  max cardinality: 1
  on property: gehoertZuBauwerk AX HeilquelleGasquelle
subclass of: Restriction
  max cardinality: 1
  on property: gehoertZuBauwerk AX Abschnitt
subclass of: Restriction
  max cardinality: 1
  on property: gehoertZuBauwerk AX Vegetationsmerkmal
subclass of: Restriction
  max cardinality: 1
  on property: gehoertZuBauwerk AX Polder
subclass of: Restriction
  max cardinality: 1
  on property: gehoertZuBauwerk AX EinrichtungenFuerDenSchiffsverkehr
subclass of: Restriction
  max cardinality: 1
  on property: gehoertZuBauwerk AX Testgelaende
subclass of: Restriction
  max cardinality: 1
  on property: gehoertZuBauwerk AX Gewaesserstationierungsachse
subclass of: Restriction
  max cardinality: 1
  on property: gehoertZuBauwerk AX SeilbahnSchwebebahn

Sonstiges Recht
type: Class
grunddatenbestand: Basis-DLM
grunddatenbestand: DLM50
kennung: 71011
modellart: Basis-DLM
modellart: DLKM
modellart: DLM1000
modellart: DLM250
modellart: DLM50
comment: 'Sonstiges Recht' sind die auf den Grund und Boden bezogenen Beschränkungen, Belastungen oder anderen Eigenschaften einer Fläche nach weiteren, nicht unter die Objektarten 71001 bis 71010 zu subsumierenden öffentlich - rechtlichen Vorschriften.
subclass of: AU Objekt
subclass of: Restriction
  all values from: ax-artderfestlegung-sonstigesrecht
  cardinality: 1
  on property: artDerFestlegung
subclass of: Restriction
  max cardinality: 1
  on property: ausfuehrendeStelle
subclass of: Restriction
  max cardinality: 1
  on property: name
subclass of: Restriction
  max cardinality: 1
  on property: bezeichnung
subclass of: Restriction
  max cardinality: 1
  on property: qualitaetsangaben

Sport-, Freizeit- und Erholungsfläche
type: Class
grunddatenbestand: Basis-DLM
grunddatenbestand: DLKM
grunddatenbestand: DLM50
kennung: 41008
modellart: Basis-DLM
modellart: DLKM
modellart: DLM250
modellart: DLM50
comment: 'Sport-, Freizeit- und Erholungsfläche' ist eine bebaute oder unbebaute Fläche, die dem Sport, der Freizeitgestaltung oder der Erholung dient.
subclass of: AX TatsaechlicheNutzung
subclass of: Restriction
  all values from: ax-funktion-sportfreizeitunderholungsflaeche
  max cardinality: 1
  on property: funktion
subclass of: Restriction
  max cardinality: 1
  on property: name
subclass of: Restriction
  all values from: ax-zustand-sportfreizeitunderholungsflaeche
  max cardinality: 1
  on property: zustand

Stehendes Gewässer
type: Class
grunddatenbestand: Basis-DLM
grunddatenbestand: DLKM
grunddatenbestand: DLM50
kennung: 44006
modellart: Basis-DLM
modellart: DLKM
modellart: DLM1000
modellart: DLM250
modellart: DLM50
comment: 'Stehendes Gewässer' ist eine natürliche oder künstliche mit Wasser gefüllte, allseitig umschlossene Hohlform der Landoberfläche ohne unmittelbaren Zusammenhang mit 'Meer'.
subclass of: AX TatsaechlicheNutzung
subclass of: Restriction
  all values from: ax-funktion-stehendesgewaesser
  max cardinality: 1
  on property: funktion
subclass of: Restriction
  max cardinality: 1
  on property: name
subclass of: Restriction
  max cardinality: 1
  on property: seekennzahl
subclass of: Restriction
  all values from: ax-hydrologischesmerkmal-stehendesgewaesser
  max cardinality: 1
  on property: hydrologischesMerkmal
subclass of: Restriction
  all values from: ax-widmung-stehendesgewaesser
  max cardinality: 1
  on property: widmung
subclass of: Restriction
  all values from: ax-schifffahrtskategorie
  max cardinality: 1
  on property: schifffahrtskategorie
subclass of: Restriction
  max cardinality: 1
  on property: bezeichnung
subclass of: Restriction
  max cardinality: 2
  on property: regionalsprache
subclass of: Restriction
  max cardinality: 1
  on property: wasserspiegelhoeheInStehendemGewaesser
subclass of: Restriction
  all values from: ax-nutzung-stehendesgewaesser
  max cardinality: 2
  on property: nutzung
subclass of: Restriction
  all values from: ax-zustand-stehendesgewaesser
  max cardinality: 1
  on property: zustand

Straße
type: Class
grunddatenbestand: Basis-DLM
grunddatenbestand: DLM50
kennung: 42002
modellart: Basis-DLM
modellart: DLKM
modellart: DLM1000
modellart: DLM250
modellart: DLM50
comment: 'Straße' ist ein befestigter, dem allgemeinen Verkehr dienender Verkehrsweg einschließlich der auf Brücken oder in Tunneln verlaufenden Abschnitte sowie die begeh- und befahrbaren Flächen in einer Fußgängerzone. Eine Straße ist einbahnig, wenn deren Fahrbahnen physisch nicht getrennt sind (keine Bauwerke wie z.B. Leitplanke, Grünstreifen). Eine Straße ist mehrbahnig, wenn nebeneinanderliegende Fahrbahnen durch Bauwerke getrennt sind und der Verkehr auf den einzelnen Fahrbahnen in Richtungen geführt wird. Ein wesentlicher Teil einer Straße ist der Straßenkörper. Zu diesem gehören Fahrbahnen, Seiten- und kleinere Trennstreifen, begleitende Gräben zur Entwässerung der Straße, kleinere Böschungen, Parkstreifen und ähnliche Einrichtungen sowie begleitende Fuß- und Radwege, wenn der Abstand zum Fahrbahnrand < 3 m ist.
subclass of: AA ZUSO
subclass of: Restriction
  all values from: ax-fahrbahntrennung-strasse
  max cardinality: 1
  on property: fahrbahntrennung
subclass of: Restriction
  all values from: ax-internationalebedeutung-strasse
  max cardinality: 1
  on property: internationaleBedeutung
subclass of: Restriction
  max cardinality: 1
  on property: name
subclass of: Restriction
  all values from: ax-widmung-strasse
  cardinality: 1
  on property: widmung
subclass of: Restriction
  max cardinality: 2
  on property: strassenschluessel
subclass of: Restriction
  max cardinality: 2
  on property: regionalsprache

Straßenachse
type: Class
grunddatenbestand: Basis-DLM
grunddatenbestand: DLM50
kennung: 42003
modellart: Basis-DLM
modellart: DLKM
modellart: DLM1000
modellart: DLM250
modellart: DLM50
comment: 'Straßenachse' beschreibt die Geometrie und Eigenschaften einer Straße und wird in der Regel von Straßeneinmündungen begrenzt. Wenn im Rahmen der Modellgenauigkeit bei einbahnigen Straßen Straßenachse und Fahrbahnachse identisch sind, wird die Straßenachse in der Mitte der Fahrbahn modelliert. Bei Straßen mit baulich getrennten Richtungsfahrbahnen verläuft die 'Straßenachse' in der Mitte der baulichen Trennung (z.B. bei Bundesautobahnen).
subclass of: TA CurveComponent
subclass of: Restriction
  all values from: ax-besondereverkehrsbedeutung
  max cardinality: 1
  on property: besondereVerkehrsbedeutung
subclass of: Restriction
  all values from: ax-besonderefahrstreifen
  max cardinality: 1
  on property: besondereFahrstreifen
subclass of: Restriction
  max cardinality: 1
  on property: breiteDerFahrbahn
subclass of: Restriction
  max cardinality: 1
  on property: breiteDesVerkehrsweges
subclass of: Restriction
  all values from: ax-funktion-strassenachse
  max cardinality: 1
  on property: funktion
subclass of: Restriction
  max cardinality: 1
  on property: anzahlDerFahrstreifen
subclass of: Restriction
  all values from: ax-zustand
  max cardinality: 1
  on property: zustand
subclass of: Restriction
  all values from: ax-oberflaechenmaterial-strasse
  max cardinality: 1
  on property: oberflaechenmaterial
subclass of: Restriction
  max cardinality: 1
  on property: fahrtrichtung

Straßenverkehr
type: Class
grunddatenbestand: Basis-DLM
grunddatenbestand: DLKM
kennung: 42001
modellart: Basis-DLM
modellart: DLKM
modellart: DLM50
comment: 'Straßenverkehr' umfasst alle für die bauliche Anlage Straße erforderlichen Flächen und die dem Straßenverkehr dienenden bebauten und unbebauten Flächen.
subclass of: AX TatsaechlicheNutzung
subclass of: Restriction
  all values from: ax-funktion-strasse
  max cardinality: 1
  on property: funktion
subclass of: Restriction
  max cardinality: 1
  on property: name
subclass of: Restriction
  max cardinality: 1
  on property: zweitname
subclass of: Restriction
  all values from: ax-zustand-strasse
  max cardinality: 1
  on property: zustand

Straßenverkehrsanlage
type: Class
grunddatenbestand: Basis-DLM
grunddatenbestand: DLM50
kennung: 53002
modellart: Basis-DLM
modellart: DLKM
modellart: DLM1000
modellart: DLM250
modellart: DLM50
comment: 'Straßenverkehrsanlage' ist eine besondere Anlage für den Straßenverkehr.
subclass of: AU Objekt
subclass of: Restriction
  all values from: ax-ergebnisderueberpruefung-bauwerkeeinrichtungenundsonstigeangaben
  max cardinality: 1
  on property: ergebnisDerUeberpruefung
subclass of: Restriction
  max cardinality: 1
  on property: qualitaetsangaben
subclass of: Restriction
  all values from: ax-art-strassenverkehrsanlage
  cardinality: 1
  on property: art
subclass of: Restriction
  max cardinality: 1
  on property: name
subclass of: Restriction
  max cardinality: 1
  on property: strassenschluessel

Strukturlinie 3D
type: Class
grunddatenbestand: Basis-DLM
grunddatenbestand: DHM
grunddatenbestand: DLM50
kennung: 62030
modellart: Basis-DLM
modellart: DHM
modellart: DLKM
modellart: DLM1000
modellart: DLM250
modellart: DLM50
modellart: LoD1
modellart: LoD2
modellart: LoD3
comment: 'Strukturlinie 3D' ist die Schnittlinie unterschiedlich geneigter Flächen. Neben 3D-CRS und CCRS (Compound Coordinate Reference System) dürfen auch 2D-CRS verwendet werden.
subclass of: AG Linienobjekt
subclass of: Restriction
  all values from: ax-art-strukturlinie3d
  max cardinality: 1
  on property: art
subclass of: Restriction
  all values from: ax-ursprung
  max cardinality: 1
  on property: ursprung
subclass of: Restriction
  max cardinality: 1
  on property: qualitaetsangaben
subclass of: Restriction
  max cardinality: 1
  on property: istGelaendeschnittlinieVon
subclass of: Restriction
  max cardinality: 1
  on property: an

Sumpf
type: Class
grunddatenbestand: Basis-DLM
grunddatenbestand: DLKM
grunddatenbestand: DLM50
kennung: 43006
modellart: Basis-DLM
modellart: DLKM
modellart: DLM1000
modellart: DLM250
modellart: DLM50
comment: 'Sumpf' ist ein wassergesättigtes, zeitweise unter Wasser stehendes Gelände. Nach Regenfällen kurzzeitig nasse Stellen im Boden werden nicht als 'Sumpf' erfasst.
subclass of: AX TatsaechlicheNutzung
subclass of: Restriction
  max cardinality: 1
  on property: name

Tagebau, Grube, Steinbruch
type: Class
grunddatenbestand: Basis-DLM
grunddatenbestand: DLKM
grunddatenbestand: DLM50
kennung: 41005
modellart: Basis-DLM
modellart: DLKM
modellart: DLM1000
modellart: DLM250
modellart: DLM50
comment: 'Tagebau, Grube, Steinbruch' ist eine Fläche, auf der oberirdisch Bodenmaterial abgebaut und für die Förderung des oberirdischen Abbaugutes genutzt wird. Rekultivierte Tagebaue, Gruben, Steinbrüche werden als Objekte entsprechend der vorhandenen Nutzung erfasst.
subclass of: AX TatsaechlicheNutzung
subclass of: Restriction
  max cardinality: 1
  on property: name
subclass of: Restriction
  all values from: ax-abbaugut-tagebaugrubesteinbruch
  max cardinality: 1
  on property: abbaugut
subclass of: Restriction
  all values from: ax-zustand-tagebaugrubesteinbruch
  max cardinality: 1
  on property: zustand
subclass of: Restriction
  max cardinality: 1
  on property: bezeichnung
subclass of: Restriction
  all values from: ax-funktion-tagebaugrubesteinbruch
  max cardinality: 1
  on property: funktion

Tagesabschnitt
type: Class
kennung: 72006
modellart: DLKM
comment: 'Tagesabschnitt' ist ein Ordnungskriterium der Schätzungsarbeiten für die geschätzte Fläche. Tagesabschnitt bezieht sich auf ein Ordnungsmerkmal, dem die Grablöcher eindeutig zugeordnet sind.
subclass of: AG Flaechenobjekt
subclass of: Restriction
  cardinality: 1
  on property: tagesabschnittsnummer

AX TatsaechlicheNutzung
type: Class
kennung: 40001
modellart: Basis-DLM
modellart: DLKM
modellart: DLM1000
modellart: DLM250
modellart: DLM50
comment: AX_TatsaechlicheNutzung ist die abstrakte Oberklasse für alle flächenförmigen Objekte aus dem Objektartenbereich Tatsächliche Nutzung. Alle Objekte, bei denen das Attribut istWeitereNutzung (IWN) nicht belegt oder die Relation hatDirektUnten (hDU) nicht vorhanden ist, gehören je nach Modellart zu jeweils demselben Thema 'Tatsächliche Nutzung DLKM (Grundfläche)', 'Tatsächliche Nutzung Basis-DLM’ oder 'Tatsächliche Nutzung DLM50’ (Quelle: AX_Themendefinition). Die Relation hatDirektUnten (hDU) regelt den Schichtenaufbau der verschiedenen Nutzungsebenen. Die Relation besteht immer zwischen einem Objekt aus dem Objektartenbereich Tatsächliche Nutzung und einem Objekt 'Bauwerk im Verkehrsbereich’, 'Bauwerk im Gewässerbereich’, 'Gebäude’, 'Damm, Wall, Deich’ oder 'Einrichtungen für den Schiffsverkehr’.
subclass of: TA SurfaceComponent
subclass of: Restriction
  max cardinality: 1
  on property: datumDerLetztenUeberpruefung
subclass of: Restriction
  max cardinality: 1
  on property: qualitaetsangaben
subclass of: Restriction
  all values from: ax-weiterenutzung-tatsaechlichenutzung
  max cardinality: 1
  on property: istWeitereNutzung
subclass of: Restriction
  all values from: ax-ergebnisderueberpruefung-tatsaechlichenutzung
  max cardinality: 1
  on property: ergebnisDerUeberpruefung

AX_TeilVonVerwaltungsgemeinschaft
type: Class
kennung: 73025
modellart: Basis-DLM
modellart: DLKM
modellart: DLM250
modellart: DLM50
comment: 'AX_TeilVonVerwaltungsgemeinschaft' enthält die Zugehörigkeit einer Gemeinde zu einer Verwaltungsgemeinschaft und deren Rolle in einer Verwaltungsgemeinschaft.
subclass of: AbstractObject

Testgelände
type: Class
kennung: 52005
modellart: Basis-DLM
modellart: DLM1000
modellart: DLM250
modellart: DLM50
comment: 'Testgelände' ist ein Gebiet zur Erprobung technischer Produkte.
subclass of: AU Objekt
subclass of: Restriction
  all values from: ax-ergebnisderueberpruefung-bauwerkeeinrichtungenundsonstigeangaben
  max cardinality: 1
  on property: ergebnisDerUeberpruefung
subclass of: Restriction
  max cardinality: 1
  on property: qualitaetsangaben
subclass of: Restriction
  max cardinality: 1
  on property: name

AX Textur3D
type: Class
kennung: 103003
modellart: LoD1
modellart: LoD2
modellart: LoD3
comment: Durch Angabe von Texturkoordinaten kann die Textur exakt zurechtgeschnitten und auf der Flächengeometrie positioniert werden.
subclass of: AX Gestaltung3D
subclass of: Restriction
  cardinality: 1
  on property: link
subclass of: Restriction
  all values from: ax-dateitypraster-textur3d
  max cardinality: 1
  on property: dateiTypRaster
subclass of: Restriction
  all values from: ax-typ-textur3d
  max cardinality: 1
  on property: typ
subclass of: Restriction
  max cardinality: 1
  on property: aktualitaet
subclass of: Restriction
  max cardinality: 1
  on property: texturVerarbeitung
subclass of: Restriction
  min cardinality: 1
  on property: texturKoordinaten

AX TexturVerarbeitung Textur3D
type: Class
kennung: 103006
modellart: LoD1
modellart: LoD2
modellart: LoD3
subclass of: AbstractObject

Topographische Linie
type: Class
kennung: 91002
modellart: DLKM
comment: 'Topographische Linie' ist eine topographische Abgrenzungslinie ohne Objektbedeutung, die Übergangsweise im Rahmen der Migration aus bestehenden Verfahrenslösungen benötigt wird.
subclass of: AU Linienobjekt
subclass of: Restriction
  all values from: ax-liniendarstellung-topographischelinie
  cardinality: 1
  on property: liniendarstellung
subclass of: Restriction
  max cardinality: 1
  on property: sonstigeEigenschaft

Transportanlage
type: Class
grunddatenbestand: Basis-DLM
grunddatenbestand: DLM50
kennung: 51004
modellart: Basis-DLM
modellart: DLKM
modellart: DLM250
modellart: DLM50
comment: 'Transportanlage' ist eine Anlage zur Förderung oder zum Transport von Flüssigkeiten, Gasen und Gütern.
subclass of: AU Objekt
subclass of: Restriction
  all values from: ax-ergebnisderueberpruefung-bauwerkeeinrichtungenundsonstigeangaben
  max cardinality: 1
  on property: ergebnisDerUeberpruefung
subclass of: Restriction
  max cardinality: 1
  on property: qualitaetsangaben
subclass of: Restriction
  all values from: ax-bauwerksfunktion-transportanlage
  cardinality: 1
  on property: bauwerksfunktion
subclass of: Restriction
  all values from: ax-produkt-transportanlage
  max cardinality: 1
  on property: produkt
subclass of: Restriction
  all values from: ax-lagezurerdoberflaeche-transportanlage
  max cardinality: 1
  on property: lageZurErdoberflaeche

Tür 3D
type: Class
kennung: 101022
modellart: LoD3
comment: 'Tür 3D' ist eine seitliche Begrenzungsfläche eines 'Bauteil 3D'.
subclass of: Oeffnung3D

Turm
type: Class
grunddatenbestand: Basis-DLM
grunddatenbestand: DLM50
kennung: 51001
modellart: Basis-DLM
modellart: DLKM
modellart: DLM1000
modellart: DLM250
modellart: DLM50
comment: 'Turm' ist ein hoch aufragendes, auf einer verhältnismäßig kleinen Fläche stehendes Bauwerk.
subclass of: AG Objekt
subclass of: Restriction
  all values from: ax-ergebnisderueberpruefung-bauwerkeeinrichtungenundsonstigeangaben
  max cardinality: 1
  on property: ergebnisDerUeberpruefung
subclass of: Restriction
  max cardinality: 1
  on property: qualitaetsangaben
subclass of: Restriction
  all values from: ax-dachform
  max cardinality: 1
  on property: dachform
subclass of: Restriction
  all values from: ax-bauwerksfunktion-turm
  max cardinality: 2
  min cardinality: 1
  on property: bauwerksfunktion
subclass of: Restriction
  max cardinality: 1
  on property: name
subclass of: Restriction
  all values from: ax-zustand-turm
  max cardinality: 1
  on property: zustand

Unland/Vegetationslose Fläche
type: Class
grunddatenbestand: Basis-DLM
grunddatenbestand: DLKM
grunddatenbestand: DLM50
kennung: 43007
modellart: Basis-DLM
modellart: DLKM
modellart: DLM1000
modellart: DLM250
modellart: DLM50
comment: 'Unland/Vegetationslose Fläche' ist eine Fläche, die nicht dauerhaft landwirtschaftlich genutzt wird, wie z. B. Fels-, Sand- oder Eisflächen, Uferstreifen längs von Gewässern und Sukzessionsflächen.
subclass of: AX TatsaechlicheNutzung
subclass of: Restriction
  all values from: ax-oberflaechenmaterial-unlandvegetationsloseflaeche
  max cardinality: 1
  on property: oberflaechenmaterial
subclass of: Restriction
  max cardinality: 1
  on property: name
subclass of: Restriction
  all values from: ax-funktion-unlandvegetationsloseflaeche
  max cardinality: 1
  on property: funktion

UntergeordnetesGewaesser
type: Class
kennung: 55002
modellart: DLKM
comment: 'UntergeordnetesGewaesser' ist ein stehendes oder fließendes Gewässer mit untergeordneter Bedeutung.
subclass of: AU Objekt
subclass of: Restriction
  all values from: ax-ergebnisderueberpruefung-bauwerkeeinrichtungenundsonstigeangaben
  max cardinality: 1
  on property: ergebnisDerUeberpruefung
subclass of: Restriction
  max cardinality: 1
  on property: qualitaetsangaben
subclass of: Restriction
  max cardinality: 1
  on property: name
subclass of: Restriction
  all values from: ax-funktion-untergeordnetesgewaesser
  max cardinality: 1
  on property: funktion
subclass of: Restriction
  all values from: ax-lagezurerdoberflaeche-untergeordnetesgewaesser
  max cardinality: 1
  on property: lageZurErdoberflaeche
subclass of: Restriction
  all values from: ax-hydrologischesmerkmal-untergeordnetesgewaesser
  max cardinality: 1
  on property: hydrologischesMerkmal

Vegetationsmerkmal
type: Class
grunddatenbestand: Basis-DLM
grunddatenbestand: DLM50
kennung: 54001
modellart: Basis-DLM
modellart: DLKM
modellart: DLM1000
modellart: DLM250
modellart: DLM50
comment: 'Vegetationsmerkmal' beschreibt den zusätzlichen Bewuchs oder besonderen Zustand einer Grundfläche.
subclass of: AU Objekt
subclass of: Restriction
  all values from: ax-ergebnisderueberpruefung-bauwerkeeinrichtungenundsonstigeangaben
  max cardinality: 1
  on property: ergebnisDerUeberpruefung
subclass of: Restriction
  max cardinality: 1
  on property: qualitaetsangaben
subclass of: Restriction
  all values from: ax-bewuchs-vegetationsmerkmal
  max cardinality: 1
  on property: bewuchs
subclass of: Restriction
  max cardinality: 1
  on property: name
subclass of: Restriction
  max cardinality: 1
  on property: bezeichnung
subclass of: Restriction
  all values from: ax-zustand-vegetationsmerkmal
  max cardinality: 1
  on property: zustand
subclass of: Restriction
  max cardinality: 1
  on property: breiteDesObjekts
subclass of: Restriction
  all values from: ax-funktion-vegetationsmerkmal
  max cardinality: 1
  on property: funktion

Verband
type: Class
kennung: 73012
modellart: DLKM
comment: 'Verband' umfasst die Verbände, denen Gemeinden angehören (z.B. Planungsverbände) mit den entsprechenden Bezeichnungen.
subclass of: AA NREO
subclass of: Restriction
  cardinality: 1
  on property: schluesselGesamt
subclass of: Restriction
  cardinality: 1
  on property: bezeichnung
subclass of: Restriction
  max cardinality: 1
  on property: einwohnerzahl
subclass of: Restriction
  max cardinality: 1
  on property: historisch
subclass of: Restriction
  max cardinality: 2
  on property: regionalsprache
subclass of: Restriction
  all values from: ax-art-verband
  max cardinality: 1
  on property: art
subclass of: Restriction
  min cardinality: 1
  on property: enthaelt

Verschlüsselte Lagebezeichnung
type: Class
grunddatenbestand: DLKM
kennung: 73023
modellart: Basis-DLM
modellart: DLKM
modellart: DLM50
comment: 'Verschlüsselte Lagebezeichnung' ist ein eindeutiges Fachkennzeichen. Die Attributart setzt sich zusammen aus dem Gemeindekennzeichen mit den Verschlüsselungen für 1. Spalte: Land 2. Spalte: Regierungsbezirk 3. Spalte: Kreis (kreisfreie Stadt) 4. Spalte: Gemeinde 5. Spalte: Lage.
subclass of: AbstractObject

Vertikaler Schweregradient
type: Class
kennung: 14012
modellart: DFGM
comment: 'Vertikaler Schweregradient' gibt den gemessenen vertikalen Schweregradienten und messungsbeschreibende Daten an. Ist der Datentyp nicht belegt, wurde der Standardwert des Freiluftgradienten zur Schwerereduktion verwendet.
subclass of: AbstractObject

Vertretung
type: Class
kennung: 21005
modellart: DLKM
comment: 'Vertretung' gibt an, welche Person eine andere Person in Katasterangelegenheiten vertritt.
subclass of: AA NREO
subclass of: Restriction
  max cardinality: 1
  on property: beginnDerVertretung
subclass of: Restriction
  max cardinality: 1
  on property: endeDerVertretung
subclass of: Restriction
  max cardinality: 1
  on property: angabenZurVertretung
subclass of: Restriction
  cardinality: 1
  on property: haengtAn

Verwaltung
type: Class
kennung: 21004
modellart: DLKM
comment: 'Verwaltung' beschreibt die Grundlagen und die Befugnisse des Verwalters entsprechend dem Wohnungseigentumsgesetz (z.B. für Wohnungs-/Teileigentum).
subclass of: AA NREO
subclass of: Restriction
  max cardinality: 1
  on property: bestellungsbeschluss
subclass of: Restriction
  max cardinality: 1
  on property: beginnDerBestellung
subclass of: Restriction
  max cardinality: 1
  on property: endeDerBestellung
subclass of: Restriction
  max cardinality: 1
  on property: notariat
subclass of: Restriction
  max cardinality: 1
  on property: grundakt
subclass of: Restriction
  max cardinality: 1
  on property: qualitaetsangaben
subclass of: Restriction
  cardinality: 1
  on property: haengtAn

Verwaltungsgemeinschaft
type: Class
kennung: 73009
modellart: Basis-DLM
modellart: DLKM
modellart: DLM50
comment: 'Verwaltungsgemeinschaft' bezeichnet einen Zusammenschluss von Gemeinden zur gemeinsamen Erfüllung von hoheitlichen Aufgaben.
subclass of: AA ZUSO
subclass of: Restriction
  cardinality: 1
  on property: schluesselGesamt
subclass of: Restriction
  cardinality: 1
  on property: bezeichnung
subclass of: Restriction
  max cardinality: 1
  on property: einwohnerzahl
subclass of: Restriction
  max cardinality: 1
  on property: historisch
subclass of: Restriction
  max cardinality: 2
  on property: regionalsprache
subclass of: Restriction
  all values from: ax-bezeichnung-verwaltungsgemeinschaft
  max cardinality: 1
  on property: bezeichnungArt
subclass of: Restriction
  cardinality: 1
  on property: schluessel

AX Verwaltungsgemeinschaft Schluessel
type: Class
kennung: 73024
modellart: Basis-DLM
modellart: DLKM
modellart: DLM250
modellart: DLM50
subclass of: AbstractObject

Vorratsbehälter, Speicherbauwerk
type: Class
kennung: 51003
modellart: Basis-DLM
modellart: DLKM
modellart: DLM50
comment: 'Vorratsbehälter, Speicherbauwerk' ist ein Bauwerk zum Aufbewahren von festen, flüssigen oder gasförmigen Stoffen.
subclass of: AG Objekt
subclass of: Restriction
  all values from: ax-ergebnisderueberpruefung-bauwerkeeinrichtungenundsonstigeangaben
  max cardinality: 1
  on property: ergebnisDerUeberpruefung
subclass of: Restriction
  max cardinality: 1
  on property: qualitaetsangaben
subclass of: Restriction
  all values from: ax-bauwerksfunktion-vorratsbehaelterspeicherbauwerk
  max cardinality: 1
  on property: bauwerksfunktion
subclass of: Restriction
  max cardinality: 1
  on property: name
subclass of: Restriction
  all values from: ax-speicherinhalt-vorratsbehaelterspeicherbauwerk
  max cardinality: 1
  on property: speicherinhalt
subclass of: Restriction
  all values from: ax-lagezurerdoberflaeche-vorratsbehaelterspeicherbauwerk
  max cardinality: 1
  on property: lageZurErdoberflaeche

Wald
type: Class
grunddatenbestand: Basis-DLM
grunddatenbestand: DLKM
grunddatenbestand: DLM50
kennung: 43002
modellart: Basis-DLM
modellart: DLKM
modellart: DLM1000
modellart: DLM250
modellart: DLM50
comment: 'Wald' ist eine Fläche, die mit Forstpflanzen (Waldbäume und Waldsträucher) bestockt ist.
subclass of: AX TatsaechlicheNutzung
subclass of: Restriction
  all values from: ax-vegetationsmerkmal-wald
  max cardinality: 1
  on property: vegetationsmerkmal
subclass of: Restriction
  max cardinality: 1
  on property: name
subclass of: Restriction
  max cardinality: 1
  on property: bezeichnung
subclass of: Restriction
  all values from: ax-zustand-wald
  max cardinality: 1
  on property: zustand
subclass of: Restriction
  all values from: ax-nutzung-wald
  max cardinality: 1
  on property: nutzung
subclass of: Restriction
  max cardinality: 2
  on property: regionalsprache

Wandfläche 3D
type: Class
kennung: 101005
modellart: LoD2
modellart: LoD3
comment: 'Wandfläche 3D' ist eine seitliche Begrenzungsfläche eines 'Bauteil 3D'.
subclass of: Begrenzungsfläche 3D

Wasserlauf
type: Class
grunddatenbestand: Basis-DLM
grunddatenbestand: DLM50
kennung: 44002
modellart: Basis-DLM
modellart: DLKM
modellart: DLM1000
modellart: DLM250
modellart: DLM50
comment: 'Wasserlauf' ist ein auf oder unter der Erdoberfläche fließendes Gewässer.
subclass of: AA ZUSO
subclass of: Restriction
  max cardinality: 1
  on property: name
subclass of: Restriction
  max cardinality: 1
  on property: gewaesserkennzahl
subclass of: Restriction
  max cardinality: 1
  on property: identnummer
subclass of: Restriction
  all values from: ax-schifffahrtskategorie
  max cardinality: 1
  on property: schifffahrtskategorie
subclass of: Restriction
  all values from: ax-widmung-wasserlauf
  max cardinality: 1
  on property: widmung
subclass of: Restriction
  max cardinality: 2
  on property: regionalsprache

Wasserspiegelhöhe
type: Class
grunddatenbestand: Basis-DLM
grunddatenbestand: DLM50
kennung: 57001
modellart: Basis-DLM
modellart: DLKM
modellart: DLM50
comment: 'Wasserspiegelhöhe' beschreibt die Höhe des Wasserspiegels an einem lagemäßig festgelegten Punkt.
subclass of: AU Punktobjekt
subclass of: Restriction
  all values from: ax-ergebnisderueberpruefung-bauwerkeeinrichtungenundsonstigeangaben
  max cardinality: 1
  on property: ergebnisDerUeberpruefung
subclass of: Restriction
  max cardinality: 1
  on property: qualitaetsangaben
subclass of: Restriction
  cardinality: 1
  on property: hoeheDesWasserspiegels

Weg
type: Class
grunddatenbestand: DLKM
kennung: 42006
modellart: Basis-DLM
modellart: DLKM
modellart: DLM50
comment: 'Weg' umfasst alle Flächen, die zum Befahren und/oder Begehen vorgesehen sind. Zur Wegfläche gehören auch Seitenstreifen und Gräben zur Wegentwässerung.
subclass of: AX TatsaechlicheNutzung
subclass of: Restriction
  all values from: ax-funktion-weg
  max cardinality: 1
  on property: funktion
subclass of: Restriction
  max cardinality: 1
  on property: name
subclass of: Restriction
  max cardinality: 1
  on property: bezeichnung

Weg, Pfad, Steig
type: Class
grunddatenbestand: Basis-DLM
grunddatenbestand: DLM50
kennung: 53003
modellart: Basis-DLM
modellart: DLKM
modellart: DLM250
modellart: DLM50
comment: 'Weg, Pfad, Steig' ist ein befestigter oder unbefestigter Geländestreifen, der zum Befahren und/oder Begehen vorgesehen ist.
subclass of: AU Objekt
subclass of: Restriction
  all values from: ax-ergebnisderueberpruefung-bauwerkeeinrichtungenundsonstigeangaben
  max cardinality: 1
  on property: ergebnisDerUeberpruefung
subclass of: Restriction
  max cardinality: 1
  on property: qualitaetsangaben
subclass of: Restriction
  all values from: ax-art-wegpfadsteig
  max cardinality: 1
  on property: art
subclass of: Restriction
  max cardinality: 1
  on property: name
subclass of: Restriction
  all values from: ax-markierung-wegpfadsteig
  max cardinality: 2
  on property: markierung
subclass of: Restriction
  all values from: ax-befestigung-wegpfadsteig
  max cardinality: 1
  on property: befestigung
subclass of: Restriction
  max cardinality: 1
  on property: breiteDesVerkehrsweges
subclass of: Restriction
  max cardinality: 1
  on property: bezeichnung
subclass of: Restriction
  max cardinality: 1
  on property: strassenschluessel
subclass of: Restriction
  max cardinality: 2
  on property: regionalsprache

Wirtschaftliche Einheit
type: Class
kennung: 75002
modellart: DLKM
comment: 'Wirtschaftliche Einheit' ist eine in der Örtlichkeit vorhandene wirtschaftliche Einheit mehrerer Flurstücke, die nicht mit der rechtlichen Einheit (Grundstück im rechtlichen Sinn) identisch sein muss (Beispiel: Wirtschaftliche Einheit zweier Flurstücke/Grundstücke, wobei nur ein Flurstück ein Erbbaugrundstück ist).
subclass of: AA ZUSO

Wohnbaufläche
type: Class
grunddatenbestand: Basis-DLM
grunddatenbestand: DLKM
kennung: 41001
modellart: Basis-DLM
modellart: DLKM
comment: 'Wohnbaufläche' ist eine baulich geprägte Fläche einschließlich der mit ihr im Zusammenhang stehenden Freiflächen (z.B. Vorgärten, Ziergärten, Zufahrten, Stellplätze und Hofraumflächen), die ausschließlich oder vorwiegend dem Wohnen dient.
subclass of: AX TatsaechlicheNutzung
subclass of: Restriction
  all values from: ax-artderbebauung-wohnbauflaeche
  max cardinality: 1
  on property: artDerBebauung
subclass of: Restriction
  max cardinality: 1
  on property: name
subclass of: Restriction
  all values from: ax-zustand-wohnbauflaeche
  max cardinality: 1
  on property: zustand
subclass of: Restriction
  all values from: ax-funktion-wohnbauflaeche
  max cardinality: 1
  on property: funktion

Wohnplatz
type: Class
kennung: 74005
modellart: Basis-DLM
modellart: DLKM
modellart: DLM50
comment: 'Wohnplatz' ist ein bewohntes Gebiet, das einen Eigennamen trägt.
subclass of: AU Punktobjekt
subclass of: Restriction
  max cardinality: 2
  on property: bezeichnung
subclass of: Restriction
  cardinality: 1
  on property: name
subclass of: Restriction
  max cardinality: 2
  on property: regionalsprache

TA CurveComponent
type: Class
kennung: 02020
comment: TA_CurveComponent ist eine Klasse von linienförmigen Fachobjekten, die einfachen topologischen Raumbezug haben und gleichzeitig entsprechende zusammengesetzte Linien realisieren. Insofern sind diese Fachobjekte mit den im Modul "Simple Topology" von ISO 19107 definierten TS_CurveComponent identisch. Jede referenzierte Kante (TS_Edge) realisiert gleichzeitig die Eigenschaften einer GM_OrientableCurve. Topologie und Geometrie fallen also zusammen. Die von einer TA_CurveComponent referenzierten Kanten / Linien sind überschneidungsfrei in einem topologischen Thema organisiert. Sie schließen geometrisch aneinander an. Zusätzlich zu diesen topologisch - geometrischen Eigenschaften gehören die Kanten / Linien einem Punkt-Linienthema an, das es ermöglicht, dass die Linien auch von anderen Objekten genutzt werden können, die zum gleichen Punkt-Linienthema gehören.
subclass of: AG ObjektMitGemeinsamerGeometrie
subclass of: Restriction
  cardinality: 1
  on property: position

TA MultiSurfaceComponent
type: Class
kennung: 02040
comment: TA_MultiSurfaceComponent ist eine Klasse von flächenförmigen Fachobjekten, die einfachen topologischen Raumbezug haben und gleichzeitig entsprechende zusammengesetzte Flächen realisieren. Insofern sind diese Fachobjekte mit den im Modul "Simple Topology" von ISO 19107 definierten Fachobjekt TS_SurfaceComponent identisch. Jede referenzierte Masche (TS_Face) realisiert gleichzeitig die Eigenschaften einer GM_OrientableSurface. Topologie und Geometrie fallen also zusammen. Die von einer TA_MultiSurfaceComponent referenzierten Maschen / Flächen sind überschneidungsfrei in einem topologischen Thema organisiert. Die Maschen schließen geometrisch aneinander an, können Enklaven (Löcher) bilden, dürfen im Gegensatz zu TA_SurfaceComponent aber auch getrennt liegen (Exklaven). Zusätzlich zu diesen topologisch - geometrischen Eigenschaften gehören die Maschen / Flächen einem Punkt-Linienthema an, das es ermöglicht, dass die Flächen sich Linien- und Punktgeometrie mit anderen Objekten teilen, die zum gleichen Punkt-Linienthema gehören.
subclass of: AG ObjektMitGemeinsamerGeometrie
subclass of: Restriction
  cardinality: 1
  on property: position

TA PointComponent
type: Class
kennung: 02010
comment: TA_PointComponent ist eine Klasse von punktförmigen Fachobjekten, die einfachen topologischen Raumbezug haben und gleichzeitig entsprechende Punktgeometrie realisieren. Insofern sind diese Fachobjekte mit den im Modul "Simple Topology" von ISO 19107 definierten TS_PointComponent identisch. Jeder referenzierte Knoten (TS_Node) realisiert gleichzeitig die Eigenschaften eines GM_Point. Topologie und Geometrie fallen also zusammen. Die von einer TA_PointComponent referenzierten Knoten / Punkte sind überschneidungsfrei in einem topologischen Thema organisiert. Zusätzlich zu diesen topologisch - geometrischen Eigenschaften gehören die Knoten / Punkte einem Punkt-Linienthema an, das es ermöglicht, dass die Linienendpunkte auch von anderen Objekten genutzt werden können, die zum gleichen Punkt-Linienthema gehören.
subclass of: AG ObjektMitGemeinsamerGeometrie
subclass of: Restriction
  cardinality: 1
  on property: position

TA SurfaceComponent
type: Class
kennung: 02030
comment: TA_SurfaceComponent ist eine Klasse von flächenförmigen Fachobjekten, die einfachen topologischen Raumbezug haben und gleichzeitig entsprechende zusammengesetzte Flächen realisieren. Insofern sind diese Fachobjekte mit den im Modul "Simple Topology" von ISO 19107 definierten Fachobjekt TS_SurfaceComponent identisch. Jede referenzierte Masche (TS_Face) realisiert gleichzeitig die Eigenschaften einer GM_OrientableSurface. Topologie und Geometrie fallen also zusammen. Die von einer TA_SurfaceComponent referenzierten Maschen / Flächen sind überschneidungsfrei in einem topologischen Thema organisiert. Sie schließen geometrisch aneinander an, können Enklaven (Löcher) bilden, dürfen jedoch nicht getrennt liegen (Exklaven). Zusätzlich zu diesen topologisch - geometrischen Eigenschaften gehören die Maschen / Flächen einem Punkt-Linienthema an, das es ermöglicht, dass die Flächen sich Linien- und Punktgeometrie mit anderen Objekten teilen, die zum gleichen Punkt-Linienthema gehören.
subclass of: AG ObjektMitGemeinsamerGeometrie
subclass of: Restriction
  cardinality: 1
  on property: position